[Date Prev][Date Next]   [Thread Prev][Thread Next]   [Thread Index] [Date Index] [Author Index]

Xine Build problem



Hi,
 
I am using Fedora Linux. I downloaded xine-lib-0.9.13.tar.gz and a, trying to install it on my machine. I got the following compilation errors.
 
gcc -DHAVE_CONFIG_H -I. -I. -I../.. -I../.. -I../.. -I../../src -I../../src -I../../src/xine-engine -I../../src/xine-engine -I../../src/xine-utils -I../../src/xine-utils -g -O2 -Wall -D_REENTRANT -D_FILE_OFFSET_BITS=64 -DXINE_COMPILE -O3 -pipe -fomit-frame-pointer -falign-functions=4 -falign-loops=4 -falign-jumps=4 -mpreferred-stack-boundary=2 -fexpensive-optimizations -fschedule-insns2 -fno-strict-aliasing -ffast-math -funroll-loops -finline-functions -mcpu=pentiumpro -I/usr/include/kde/artsc -I/usr/X11R6/include -DXINE_COMPILE -I/usr/include/SDL -D_REENTRANT -I../../src/video_out/vidix -I../../src/video_out/vidix -c deinterlace.c  -DPIC -o deinterlace.lo
{standard input}: Assembler messages:
{standard input}:665: Error: suffix or operands invalid for `pmullw'
{standard input}:669: Error: suffix or operands invalid for `pcmpgtw'
{standard input}:762: Error: suffix or operands invalid for `pmullw'
{standard input}:766: Error: suffix or operands inval! id for `pcmpgtw'
{standard input}:845: Error: suffix or operands invalid for `pmullw'
{standard input}:849: Error: suffix or operands invalid for `pcmpgtw'
{standard input}:1138: Error: suffix or operands invalid for `movq'
{standard input}:1150: Error: suffix or operands invalid for `movq'
{standard input}:1254: Error: suffix or operands invalid for `movq'
{standard input}:1266: Error: suffix or operands invalid for `movq'
{standard input}:1357: Error: suffix or operands invalid for `movq'
{standard input}:1369: Error: suffix or operands invalid for `movq'
make[4]: *** [deinterlace.lo] Error 1
make[4]: Leaving directory `/root/xine-lib-0.9.13/src/video_out'
make[3]: *** [all-recursive] Error 1
make[3]: Leaving directory `/root/xine-lib-0.9.13/src/video_out'
make[2]: *** [all-recursive] Error 1
make[2]: Leaving directory `/root/xine-lib-0.9.13/src'
make[1]: *** [all-recursive] Error 1
make[1]: Leaving directory `/root/xine-lib-0.9.13'
make: *** [all-recursive-am] Error 2
 
Could somebody help me in fixing this problem.
 
I have not subscribed to xine mailing list - so please mark a copy to me.
 
Thanks in advance,
 
regards
-Ravi
 

Yahoo! India Matrimony: Find your partner online.


[Date Prev][Date Next]   [Thread Prev][Thread Next]   [Thread Index] [Date Index] [Author Index]