[Date Prev][Date Next]   [Thread Prev][Thread Next]   [Thread Index] [Date Index] [Author Index]

Build error



I recently rebuilt kst in devel for the license tag change.  There were
no other spec file or source file changes, and kst was last rebuilt in
devel 10 days ago (with no issues).  However, now the build fails.  I
don't quite know what's going on here.  Any ideas?

Build log:
http://koji.fedoraproject.org/koji/getfile?taskID=86257&name=build.log

Quick excerpt:
make[5]: Leaving directory
`/builddir/build/BUILD/kst-1.4.0/kst/src/datasources/dirfile'
make[5]: Entering directory
`/builddir/build/BUILD/kst-1.4.0/kst/src/datasources/dirfile'
/bin/sh ../../../../libtool --silent --tag=CXX --mode=compile g++
-DHAVE_CONFIG_H -I. -I. -I../../../.. -I../../../../kst/src/libkst
-I../../../../kst/src/libkst -I../../../../kst/src/extdate
-I/usr/include/kde -I/usr/lib64/qt-3.3/include -I.
-I/usr/include/cfitsio -I/usr/include/netcdf-3  -DQT_THREAD_SUPPORT
-D_REENTRANT  -Wno-long-long -Wundef -ansi -D_XOPEN_SOURCE=500
-D_BSD_SOURCE -Wcast-align -Wchar-subscripts -Wall -W -Wpointer-arith
-DNDEBUG -DNO_DEBUG -O2 -O2 -g -pipe -Wall -Wp,-D_FORTIFY_SOURCE=2
-fexceptions -fstack-protector --param=ssp-buffer-size=4 -m64
-mtune=generic -Wformat-security -Wmissing-format-attribute
-Wno-non-virtual-dtor -fno-exceptions -fno-check-new -fno-common
-DQT_CLEAN_NAMESPACE -DQT_NO_ASCII_CAST -DQT_NO_STL -DQT_NO_COMPAT
-DQT_NO_TRANSLATION  -c -o dirfile.lo dirfile.cpp
/bin/sh ../../../../libtool --silent --tag=CC --mode=compile gcc
-DHAVE_CONFIG_H -I. -I. -I../../../.. -I../../../../kst/src/libkst
-I../../../../kst/src/libkst -I../../../../kst/src/extdate
-I/usr/include/kde -I/usr/lib64/qt-3.3/include -I.
-I/usr/include/cfitsio -I/usr/include/netcdf-3  -DQT_THREAD_SUPPORT
-D_REENTRANT  -std=iso9899:1990 -W -Wall -Wchar-subscripts -Wshadow
-Wpointer-arith -Wmissing-prototypes -Wwrite-strings -D_XOPEN_SOURCE=500
-D_BSD_SOURCE -DNDEBUG -O2  -O2 -g -pipe -Wall -Wp,-D_FORTIFY_SOURCE=2
-fexceptions -fstack-protector --param=ssp-buffer-size=4 -m64
-mtune=generic -Wformat-security -Wmissing-format-attribute -c -o
getdata.lo getdata.c
getdata.c: In function 'ParsePhase':
getdata.c:448: warning: unused parameter 'n_cols'
getdata.c:449: warning: unused parameter 'format_file'
getdata.c:449: warning: unused parameter 'line'
getdata.c: In function 'GetNFrames':
getdata.c:2077: warning: unused parameter 'in_field'
getdata.c: In function 'DoIfRawOut':
getdata.c:2207: error: size of array '__open_missing_mode' is negative
make[5]: *** [getdata.lo] Error 1
make[5]: *** Waiting for unfinished jobs....
getdata.h:14: warning: 'double __NAN()' defined but not used
make[5]: Leaving directory
`/builddir/build/BUILD/kst-1.4.0/kst/src/datasources/dirfile'
make[4]: *** [all-recursive] Error 1
make[4]: Leaving directory
`/builddir/build/BUILD/kst-1.4.0/kst/src/datasources'
make[3]: *** [all-recursive] Error 1
make[3]: Leaving directory `/builddir/build/BUILD/kst-1.4.0/kst/src'
make[2]: *** [all-recursive] Error 1
make[2]: Leaving directory `/builddir/build/BUILD/kst-1.4.0/kst'
make[1]: *** [all-recursive] Error 1
make[1]: Leaving directory `/builddir/build/BUILD/kst-1.4.0'
make: *** [all] Error 2
error: Bad exit status from /var/tmp/rpm-tmp.73014 (%build)


-- 
"Hermits don't have peer pressure."
--------------------------
Matthew Truch
Department of Physics and Astronomy
University of Pennsylvania
matt truch net
http://matt.truch.net/

Attachment: pgpCBYAGUFBVI.pgp
Description: PGP signature


[Date Prev][Date Next]   [Thread Prev][Thread Next]   [Thread Index] [Date Index] [Author Index]