[Date Prev][Date Next]   [Thread Prev][Thread Next]   [Thread Index] [Date Index] [Author Index]

Re: Koji busted?



Bojan Smojver wrote:
I built a package for F-10 successfully, but multiple attempts to do the
same for F-9 were not successful:
----------------------------------
/usr/bin/koji  build  dist-f9-updates-candidate
'cvs://cvs.fedoraproject.org/cvs/pkgs?rpms/tcpreplay/F-9#tcpreplay-3_4_1-1_fc9'
Created task: 1144900
Task info: http://koji.fedoraproject.org/koji/taskinfo?taskID=1144900
Watching tasks (this may be safely interrupted)...
1144900 build
(dist-f9-updates-candidate, /cvs/pkgs:rpms/tcpreplay/F-9:tcpreplay-3_4_1-1_fc9): open (ppc3.fedora.redhat.com)
  1144901 buildSRPMFromSCM
(/cvs/pkgs:rpms/tcpreplay/F-9:tcpreplay-3_4_1-1_fc9): free
  1144901 buildSRPMFromSCM
(/cvs/pkgs:rpms/tcpreplay/F-9:tcpreplay-3_4_1-1_fc9): free -> open
(x86-7.fedora.phx.redhat.com)
  1144901 buildSRPMFromSCM
(/cvs/pkgs:rpms/tcpreplay/F-9:tcpreplay-3_4_1-1_fc9): open
(x86-7.fedora.phx.redhat.com) -> FAILED: BuildrootError: could not init
mock buildroot, mock exited with status 20; see root.log for more
information
  0 free  1 open  0 done  1 failed
1144900 build
(dist-f9-updates-candidate, /cvs/pkgs:rpms/tcpreplay/F-9:tcpreplay-3_4_1-1_fc9): open (ppc3.fedora.redhat.com) -> FAILED: BuildrootError: could not init mock buildroot, mock exited with status 20; see root.log for more information
  0 free  0 open  0 done  2 failed

1144900 build
(dist-f9-updates-candidate, /cvs/pkgs:rpms/tcpreplay/F-9:tcpreplay-3_4_1-1_fc9) failed
make: *** [koji] Error 1
----------------------------------

Any ideas?

The Koji outage had not been completed. it should now be ok. all repos should have been regenerated.

Dennis


[Date Prev][Date Next]   [Thread Prev][Thread Next]   [Thread Index] [Date Index] [Author Index]