[Date Prev][Date Next]   [Thread Prev][Thread Next]   [Thread Index] [Date Index] [Author Index]

axis2: openjdk6 javascript e4x rhino



I've been trying to get axis2 built for F11.  The newest version that meets all the dependencies is axis2 1.3 due to maven2 being only at 2.0.4.  Axis2 1.3 nearly builds except for failing tests for the Scripting Module:

-------------------------------------------------------
 T E S T S
-------------------------------------------------------
Running org.apache.axis2.scripting.convertors.JSOMElementConvertorTest
Tests run: 2, Failures: 0, Errors: 2, Skipped: 0, Time elapsed: 0.797 sec <<< FAILURE!
Running org.apache.axis2.scripting.ScriptReceiverTest
Tests run: 2, Failures: 0, Errors: 2, Skipped: 0, Time elapsed: 0.081 sec <<< FAILURE!

Results :

Tests in error:
  testToAndFromScript(org.apache.axis2.scripting.convertors.JSOMElementConvertorTest)
  testFromScript(org.apache.axis2.scripting.convertors.JSOMElementConvertorTest)
  testInvokeBusinessLogic(org.apache.axis2.scripting.ScriptReceiverTest)
  testAxisService(org.apache.axis2.scripting.ScriptReceiverTest)

Tests run: 4, Failures: 0, Errors: 4, Skipped: 0

[INFO] ------------------------------------------------------------------------
[ERROR] BUILD FAILURE
[INFO] ------------------------------------------------------------------------
[INFO] There are test failures.


This appears to be related to this bug:  https://bugs.launchpad.net/ubuntu/+source/openjdk-6/+bug/255149

What is the best way to workaround this rhino problem with openjdk6?

-Gerry


[Date Prev][Date Next]   [Thread Prev][Thread Next]   [Thread Index] [Date Index] [Author Index]