[Date Prev][Date Next]   [Thread Prev][Thread Next]   [Thread Index] [Date Index] [Author Index]

[Fwd: Build Error (Job 4112): libstatgrab-0_12-1_fc5 on fedora-development-extras]



Hi!

Can someone help me with this?

I have no x86_64 machine at hand at the moment and therfor cannot diag this very well... :-(

Maybe not building with smp_mflags!?

Thanks,
 -of

-------- Original Message --------
Subject: Build Error (Job 4112): libstatgrab-0_12-1_fc5 on fedora-development-extras
Date: Mon, 13 Feb 2006 11:43:10 -0500 (EST)
From: buildsys fedoraproject org
To: oliver linux-kernel at

Job failed on arch x86_64


Build logs may be found at http://buildsys.fedoraproject.org/logs/fedora-development-extras/4112-libstatgrab-0.12-1.fc5/


-------------------------------------------------

then mv -f ".deps/user_list.Tpo" ".deps/user_list.Po"; else rm -f ".deps/user_list.Tpo"; exit 1; fi if gcc -DHAVE_CONFIG_H -I. -I. -I.. -I.. -I.. -I../src -I../src -I../src/libstatgrab -I../src/libstatgrab -O2 -g -pipe -Wall -Wp,-D_FORTIFY_SOURCE=2 -fexceptions -fstack-protector --param=ssp-buffer-size=4 -m64 -mtune=generic -MT page_stats.o -MD -MP -MF ".deps/page_stats.Tpo" -c -o page_stats.o page_stats.c; \ then mv -f ".deps/page_stats.Tpo" ".deps/page_stats.Po"; else rm -f ".deps/page_stats.Tpo"; exit 1; fi if gcc -DHAVE_CONFIG_H -I. -I. -I.. -I.. -I.. -I../src -I../src -I../src/libstatgrab -I../src/libstatgrab -O2 -g -pipe -Wall -Wp,-D_FORTIFY_SOURCE=2 -fexceptions -fstack-protector --param=ssp-buffer-size=4 -m64 -mtune=generic -MT network_iface_stats.o -MD -MP -MF ".deps/network_iface_stats.Tpo" -c -o network_iface_stats.o network_iface_stats.c; \ then mv -f ".deps/network_iface_stats.Tpo" ".deps/network_iface_stats.Po"; else rm -f ".deps/network_iface_stats.Tpo"; exit 1; fi if gcc -DHAVE_CONFIG_H -I. -I. -I.. -I.. -I.. -I../src -I../src -I../src/libstatgrab -I../src/libstatgrab -O2 -g -pipe -Wall -Wp,-D_FORTIFY_SOURCE=2 -fexceptions -fstack-protector --param=ssp-buffer-size=4 -m64 -mtune=generic -MT process_snapshot.o -MD -MP -MF ".deps/process_snapshot.Tpo" -c -o process_snapshot.o process_snapshot.c; \ then mv -f ".deps/process_snapshot.Tpo" ".deps/process_snapshot.Po"; else rm -f ".deps/process_snapshot.Tpo"; exit 1; fi /bin/sh ../libtool --tag=CC --mode=link gcc -O2 -g -pipe -Wall -Wp,-D_FORTIFY_SOURCE=2 -fexceptions -fstack-protector --param=ssp-buffer-size=4 -m64 -mtune=generic -o network_traffic network_traffic.o ../src/libstatgrab/libstatgrab.la /bin/sh ../libtool --tag=CC --mode=link gcc -O2 -g -pipe -Wall -Wp,-D_FORTIFY_SOURCE=2 -fexceptions -fstack-protector --param=ssp-buffer-size=4 -m64 -mtune=generic -o disk_traffic disk_traffic.o ../src/libstatgrab/libstatgrab.la
mkdir .libs
gcc -O2 -g -pipe -Wall -Wp,-D_FORTIFY_SOURCE=2 -fexceptions -fstack-protector --param=ssp-buffer-size=4 -m64 -mtune=generic -o .libs/network_traffic network_traffic.o ../src/libstatgrab/.libs/libstatgrab.so -Wl,--rpath -Wl,/usr/lib64
creating network_traffic
gcc -O2 -g -pipe -Wall -Wp,-D_FORTIFY_SOURCE=2 -fexceptions -fstack-protector --param=ssp-buffer-size=4 -m64 -mtune=generic -o .libs/disk_traffic disk_traffic.o ../src/libstatgrab/.libs/libstatgrab.so -Wl,--rpath -Wl,/usr/lib64
creating disk_traffic
/bin/sh ../libtool --tag=CC --mode=link gcc -O2 -g -pipe -Wall -Wp,-D_FORTIFY_SOURCE=2 -fexceptions -fstack-protector --param=ssp-buffer-size=4 -m64 -mtune=generic -o cpu_usage cpu_usage.o ../src/libstatgrab/libstatgrab.la /bin/sh ../libtool --tag=CC --mode=link gcc -O2 -g -pipe -Wall -Wp,-D_FORTIFY_SOURCE=2 -fexceptions -fstack-protector --param=ssp-buffer-size=4 -m64 -mtune=generic -o load_stats load_stats.o ../src/libstatgrab/libstatgrab.la libtool: link: `../src/libstatgrab/libstatgrab.la' is not a valid libtool archive
make[2]: *** [load_stats] Error 1
make[2]: *** Waiting for unfinished jobs....
gcc -O2 -g -pipe -Wall -Wp,-D_FORTIFY_SOURCE=2 -fexceptions -fstack-protector --param=ssp-buffer-size=4 -m64 -mtune=generic -o .libs/cpu_usage cpu_usage.o ../src/libstatgrab/.libs/libstatgrab.so -Wl,--rpath -Wl,/usr/lib64
creating cpu_usage
make[2]: Leaving directory `/builddir/build/BUILD/libstatgrab-0.12/examples'
make[1]: *** [all-recursive] Error 1
make[1]: Leaving directory `/builddir/build/BUILD/libstatgrab-0.12'
make: *** [all] Error 2
error: Bad exit status from /var/tmp/rpm-tmp.97371 (%build)


RPM build errors:
    Bad exit status from /var/tmp/rpm-tmp.97371 (%build)


[Date Prev][Date Next]   [Thread Prev][Thread Next]   [Thread Index] [Date Index] [Author Index]