[Date Prev][Date Next]   [Thread Prev][Thread Next]   [Thread Index] [Date Index] [Author Index]

[Bug 205136] Review Request: gg2 - GNU Gadu 2 - free talking



Please do not reply directly to this email. All additional
comments should be made in the comments box of this bug report.

Summary: Review Request: gg2 - GNU Gadu 2 - free talking


https://bugzilla.redhat.com/bugzilla/show_bug.cgi?id=205136


mr ecik gmail com changed:

           What    |Removed                     |Added
----------------------------------------------------------------------------
             Status|NEW                         |ASSIGNED
         AssignedTo|nobody fedoraproject org    |mr ecik gmail com
OtherBugsDependingO|163776                      |163778
              nThis|                            |




------- Additional Comments From mr ecik gmail com  2006-09-14 16:37 EST -------
I'll review it, but as mentioned above, there is problem with mock build:
dbus_plugin.c: In function 'ofi_getProtocols':
dbus_plugin.c:143: warning: ISO C90 forbids mixed declarations and code
dbus_plugin.c: In function 'start_plugin':
dbus_plugin.c:301: warning: cast from pointer to integer of different size
/bin/sh ../../../libtool --silent --tag=CC --mode=link gcc  -O2 -g -pipe -Wall -
Wp,-D_FORTIFY_SOURCE=2 -fexceptions -fstack-protector --param=ssp-buffer-size=4 
-m64 -mtune=generic -pthread -Wall -Wno-uninitialized -Wchar-subscripts -
Wnested-externs -Wpointer-arith -Wno-sign-compare -I/usr/include/glib-2.0 -I/
usr/lib64/glib-2.0/include    -O2 -g -pipe -Wall -Wp,-D_FORTIFY_SOURCE=2 -
fexceptions -fstack-protector --param=ssp-buffer-size=4 -m64 -mtune=generic -
pthread -Wall -Wno-uninitialized -Wchar-subscripts -Wnested-externs -Wpointer-
arith -Wno-sign-compare -I/usr/include/glib-2.0 -I/usr/lib64/glib-2.0/
include     -D_REENTRANT -D_GNU_SOURCE -fno-strict-aliasing -pipe -Wdeclaration-
after-statement -I/usr/local/include -D_LARGEFILE_SOURCE -D_FILE_OFFSET_BITS=64 
-I/usr/include/gdbm  -I/usr/lib64/perl5/5.8.8/x86_64-linux-thread-multi/CORE  -
I/builddir/build/BUILD/gg2-2.2.9/lib  -lglib-2.0   -pthread -lgthread-2.0 -
lglib-2.0   -o libdbus_plugin.la -rpath /usr/lib64/gg2 -avoid-version   
libdbus_plugin_la-dbus_plugin.lo -ldbus-glib-1 -ldbus-1 -lglib-2.0   ../../../
lib/libgg2_core.la -pthread
/usr/bin/ld: cannot find -ldbus-glib-1
collect2: ld returned 1 exit status
gmake[4]: *** [libdbus_plugin.la] Error 1
gmake[4]: Leaving directory `/builddir/build/BUILD/gg2-2.2.9/src/plugins/dbus'
gmake[3]: *** [all-recursive] Error 1
gmake[3]: Leaving directory `/builddir/build/BUILD/gg2-2.2.9/src/plugins'
gmake[2]: *** [all-recursive] Error 1
gmake[2]: Leaving directory `/builddir/build/BUILD/gg2-2.2.9/src'
gmake[1]: *** [all-recursive] Error 1
gmake[1]: Leaving directory `/builddir/build/BUILD/gg2-2.2.9'
make: *** [all] Error 2
error: Bad exit status from /var/tmp/rpm-tmp.5727 (%build)


RPM build errors:
    Bad exit status from /var/tmp/rpm-tmp.5727 (%build)


-- 
Configure bugmail: https://bugzilla.redhat.com/bugzilla/userprefs.cgi?tab=email
------- You are receiving this mail because: -------
You are the QA contact for the bug, or are watching the QA contact.


[Date Prev][Date Next]   [Thread Prev][Thread Next]   [Thread Index] [Date Index] [Author Index]