[Date Prev][Date Next]   [Thread Prev][Thread Next]   [Thread Index] [Date Index] [Author Index]

x86_64 evolution 1.5.7 WAS: Novell/Ximian Connector For Evolution GPL'd



On Wed, 2004-05-12 at 10:43 -0400, David Malcolm wrote:
> I've taken over packaging the new Evolution from Jeremy; you can get Evo
> 1.5.7 from here now:
> http://people.redhat.com/dmalcolm
> 
> (this is 1.5.7 plus some bugfixes plus a patch to use the new file
> selector dialog)
> 
> I'm working on the Connector stuff; should be there soon.

Hey Dave,

I have taken your src.rpms from above and tried to get all of them to
compile on x86_64.  Everything except for the main evolution rpm builds.
I get this error on a rpmbuild -ba evolution.spec:

gcc -O2 -g -pipe -fPIC -I/usr/include/et -Wall -Wmissing-prototypes -Wno-sign-compare -o .libs/test-calendar test-calendar.o -Wl,--export-dynamic  ./.libs/libemiscwidgets.so /usr/src/redhat/BUILD/evolution-1.5.7/e-util/.libs/libeutil.so -L/usr/X11R6/lib64 -L/usr/lib /usr/src/redhat/BUILD/evolution-1.5.7/a11y/widgets/.libs/libevolution-widgets-a11y.so /usr/src/redhat/BUILD/evolution-1.5.7/a11y/.libs/libevolution-a11y.so -ledataserver ../../e-util/.libs/libeutil.so /usr/lib64/libpopt.so -lplc4 -lplds4 -lnspr4 -pthread -lgnomeui-2 -lSM -lICE -lbonoboui-2 -lgnome-2 /usr/lib/libpopt.so -lbonobo-2 -lgnomevfs-2 -lbonobo-activation -lgnomecanvas-2 -lpangoft2-1.0 -lgconf-2 -lORBit-2 -lgthread-2.0 -lgal-2.2 -lgal-a11y-2.2 -lglade-2.0 -lgnomeprint-2-2 -lgtk-x11-2.0 -lgdk-x11-2.0 -latk-1.0 -lgdk_pixbuf-2.0 -lpangoxft-1.0 -lpangox-1.0 -lart_lgpl_2 /usr/lib64/libxml2.so -lpthread -lz -lm -lpango-1.0 -lgobject-2.0 -lgmodule-2.0 -ldl -lglib-2.0 -Wl,--rpath -Wl,/usr/lib64/evolution/1.5 -Wl,--rpath -Wl,/usr/lib
/usr/lib/libpopt.so: could not read symbols: Invalid operation
collect2: ld returned 1 exit status
make[3]: *** [test-calendar] Error 1
make[3]: Leaving directory `/usr/src/redhat/BUILD/evolution-1.5.7/widgets/misc'
make[2]: *** [all-recursive] Error 1
make[2]: Leaving directory `/usr/src/redhat/BUILD/evolution-1.5.7/widgets'
make[1]: *** [all-recursive] Error 1
make[1]: Leaving directory `/usr/src/redhat/BUILD/evolution-1.5.7'
make: *** [all-recursive-am] Error 2
error: Bad exit status from /var/tmp/rpm-tmp.3892 (%build)
 
 
RPM build errors:
    Bad exit status from /var/tmp/rpm-tmp.3892 (%build)

[root d-mpk14-95-238 SPECS]# file /usr/lib/libpopt.so
/usr/lib/libpopt.so: symbolic link to `libpopt.so.0.0.0'
[root d-mpk14-95-238 SPECS]# file /usr/lib/libpopt.so.0.0.0
/usr/lib/libpopt.so.0.0.0: ELF 32-bit LSB shared object, Intel 80386, version 1 (SYSV), stripped

Looks like it is trying to link against the 32-bit version of this
library.

In any event, do you plan on providing x86_64 packages for these or
should I continue to try to dig in and fix this?

Thanks.

-tduffy 

Attachment: signature.asc
Description: This is a digitally signed message part


[Date Prev][Date Next]   [Thread Prev][Thread Next]   [Thread Index] [Date Index] [Author Index]