[Date Prev][Date Next]   [Thread Prev][Thread Next]   [Thread Index] [Date Index] [Author Index]

Re: New unstable Evolution (1.5.8)



On Fri, 2004-05-21 at 18:46 -0400, David Malcolm wrote:
> I've built RPMs of the new Evolution release (1.5.8) and its
> dependencies for FC2 in my usual yum archive:
> http://people.redhat.com/dmalcolm
> 
> Usual disclaimers apply: this is an unstable release, for testing
> purposes.  Enjoy!

Two issues:

1) it looks like the old style file selection is back (yuk).

2) it still doesn't compile on x86_64

gcc -O2 -g -pipe -fPIC -I/usr/include/et -Wall -Wmissing-prototypes -Wno-sign-compare -o .libs/test-calendar test-calendar.o -Wl,--export-dynamic  ./.libs/libemiscwidgets.so /usr/src/redhat/BUILD/evolution-1.5.8/e-util/.libs/libeutil.so -L/usr/X11R6/lib64 -L/usr/lib /usr/src/redhat/BUILD/evolution-1.5.8/a11y/widgets/.libs/libevolution-widgets-a11y.so /usr/src/redhat/BUILD/evolution-1.5.8/a11y/.libs/libevolution-a11y.so -ledataserver ../../e-util/.libs/libeutil.so /usr/lib64/libpopt.so -lplc4 -lplds4 -lnspr4 -pthread -lgnomeui-2 -lSM -lICE -lbonoboui-2 -lgnome-2 /usr/lib/libpopt.so -lbonobo-2 -lgnomevfs-2 -lbonobo-activation -lgconf-2 -lORBit-2 -lgthread-2.0 -lgal-2.2 -lgal-a11y-2.2 -lgnomecanvas-2 -lglade-2.0 -lgnomeprint-2-2 -lpangoft2-1.0 -lgtk-x11-2.0 -lgdk-x11-2.0 -latk-1.0 -lgdk_pixbuf-2.0 -lpangoxft-1.0 -lpangox-1.0 -lart_lgpl_2 /usr/lib64/libxml2.so -lpthread -lz -lm -lpango-1.0 -lgobject-2.0 -lgmodule-2.0 -ldl -lglib-2.0 -Wl,--rpath -Wl,/usr/lib64/evolution/1.5 -Wl,--rpath -Wl,/usr/lib
/usr/lib/libpopt.so: could not read symbols: Invalid operation
collect2: ld returned 1 exit status
make[4]: *** [test-calendar] Error 1
make[4]: Leaving directory `/usr/src/redhat/BUILD/evolution-1.5.8/widgets/misc'
make[3]: *** [all] Error 2
make[3]: Leaving directory `/usr/src/redhat/BUILD/evolution-1.5.8/widgets/misc'
make[2]: *** [all-recursive] Error 1
make[2]: Leaving directory `/usr/src/redhat/BUILD/evolution-1.5.8/widgets'
make[1]: *** [all-recursive] Error 1
make[1]: Leaving directory `/usr/src/redhat/BUILD/evolution-1.5.8'
make: *** [all] Error 2
error: Bad exit status from /var/tmp/rpm-tmp.47317 (%build)
 
 
RPM build errors:
    Bad exit status from /var/tmp/rpm-tmp.47317 (%build)

Attachment: signature.asc
Description: This is a digitally signed message part


[Date Prev][Date Next]   [Thread Prev][Thread Next]   [Thread Index] [Date Index] [Author Index]