[Date Prev][Date Next]   [Thread Prev][Thread Next]   [Thread Index] [Date Index] [Author Index]

[Cluster-devel] conga compile error LLONG_MAX not declared in this scope



-----BEGIN PGP SIGNED MESSAGE-----
Hash: SHA1


Hello,

while trying to compile conga, I get the following error.

g++ -Wall -Wno-unused -fPIC -g -I ../../include `pkg-config --cflags
libxml-2.0` `pkg-config --cflags openssl`     -c -o ContentNone.o
ContentNone.cpp
ContentNone.cpp: In member function 'virtual bool
ContentNone::expandable(long long int&) const':
ContentNone.cpp:50: error: 'LLONG_MAX' was not declared in this scope
make[3]: *** [ContentNone.o] Error 1
make[3]: Leaving directory `/home/gdsm/cluster/conga/ricci/modules/storage'
make[2]: *** [all] Error 2
make[2]: Leaving directory `/home/gdsm/cluster/conga/ricci/modules'
make[1]: *** [ricci] Error 2
make[1]: Leaving directory `/home/gdsm/cluster/conga/ricci'
make: *** [ricci] Error 2
gdsm pc:~/cluster/conga$

This may also be of help:
cvs status
<snip>
===================================================================
File: ContentNone.cpp   Status: Up-to-date

   Working revision:    1.4
   Repository revision: 1.4
/cvs/cluster/conga/ricci/modules/storage/ContentNone.cpp,v
   Sticky Tag:          (none)
   Sticky Date:         (none)
   Sticky Options:      (none)

===================================================================
File: ContentNone.h     Status: Up-to-date

   Working revision:    1.3
   Repository revision: 1.3
/cvs/cluster/conga/ricci/modules/storage/ContentNone.h,v
   Sticky Tag:          (none)
   Sticky Date:         (none)
   Sticky Options:      (none)

===================================================================
<snip>

Many thanks,

Spencer

-----BEGIN PGP SIGNATURE-----
Version: GnuPG v1.4.5 (GNU/Linux)

iD8DBQFFjIH+I1ja71kPXjARAiNiAKCegO2wtk3DjfzhIEPza9x9xaMsEQCgjOqq
id+yXzsxZ7Vs9N4mvZEfvt8=
=cHrr
-----END PGP SIGNATURE-----


[Date Prev][Date Next]   [Thread Prev][Thread Next]   [Thread Index] [Date Index] [Author Index]