[Date Prev][Date Next]   [Thread Prev][Thread Next]   [Thread Index] [Date Index] [Author Index]

[dm-devel] Error when compiling drivers/md/dm-bufio.c



I just got error on todays Linus' tree


  CC [M]  drivers/md/dm-bufio.o
drivers/md/dm-bufio.c:988:1: warning: data definition has no type or storage class [enabled by default]
drivers/md/dm-bufio.c:988:1: warning: type defaults to ‘int’ in declaration of ‘EXPORT_SYMBOL_GPL’ [-Wimplicit-int]
drivers/md/dm-bufio.c:988:1: warning: parameter names (without types) in function declaration [enabled by default]
drivers/md/dm-bufio.c:997:1: warning: data definition has no type or storage class [enabled by default]
drivers/md/dm-bufio.c:997:1: warning: type defaults to ‘int’ in declaration of ‘EXPORT_SYMBOL_GPL’ [-Wimplicit-int]
drivers/md/dm-bufio.c:997:1: warning: parameter names (without types) in function declaration [enabled by default]
drivers/md/dm-bufio.c:1006:1: warning: data definition has no type or storage class [enabled by default]
drivers/md/dm-bufio.c:1006:1: warning: type defaults to ‘int’ in declaration of ‘EXPORT_SYMBOL_GPL’ [-Wimplicit-int]
drivers/md/dm-bufio.c:1006:1: warning: parameter names (without types) in function declaration [enabled by default]
drivers/md/dm-bufio.c:1036:1: warning: data definition has no type or storage class [enabled by default]
drivers/md/dm-bufio.c:1036:1: warning: type defaults to ‘int’ in declaration of ‘EXPORT_SYMBOL_GPL’ [-Wimplicit-int]
drivers/md/dm-bufio.c:1036:1: warning: parameter names (without types) in function declaration [enabled by default]
drivers/md/dm-bufio.c:1049:1: warning: data definition has no type or storage class [enabled by default]
drivers/md/dm-bufio.c:1049:1: warning: type defaults to ‘int’ in declaration of ‘EXPORT_SYMBOL_GPL’ [-Wimplicit-int]
drivers/md/dm-bufio.c:1049:1: warning: parameter names (without types) in function declaration [enabled by default]
drivers/md/dm-bufio.c:1059:1: warning: data definition has no type or storage class [enabled by default]
drivers/md/dm-bufio.c:1059:1: warning: type defaults to ‘int’ in declaration of ‘EXPORT_SYMBOL_GPL’ [-Wimplicit-int]
drivers/md/dm-bufio.c:1059:1: warning: parameter names (without types) in function declaration [enabled by default]
drivers/md/dm-bufio.c:1135:1: warning: data definition has no type or storage class [enabled by default]
drivers/md/dm-bufio.c:1135:1: warning: type defaults to ‘int’ in declaration of ‘EXPORT_SYMBOL_GPL’ [-Wimplicit-int]
drivers/md/dm-bufio.c:1135:1: warning: parameter names (without types) in function declaration [enabled by default]
drivers/md/dm-bufio.c:1158:1: warning: data definition has no type or storage class [enabled by default]
drivers/md/dm-bufio.c:1158:1: warning: type defaults to ‘int’ in declaration of ‘EXPORT_SYMBOL_GPL’ [-Wimplicit-int]
drivers/md/dm-bufio.c:1158:1: warning: parameter names (without types) in function declaration [enabled by default]
drivers/md/dm-bufio.c:1232:1: warning: data definition has no type or storage class [enabled by default]
drivers/md/dm-bufio.c:1232:1: warning: type defaults to ‘int’ in declaration of ‘EXPORT_SYMBOL_GPL’ [-Wimplicit-int]
drivers/md/dm-bufio.c:1232:1: warning: parameter names (without types) in function declaration [enabled by default]
drivers/md/dm-bufio.c:1238:1: warning: data definition has no type or storage class [enabled by default]
drivers/md/dm-bufio.c:1238:1: warning: type defaults to ‘int’ in declaration of ‘EXPORT_SYMBOL_GPL’ [-Wimplicit-int]
drivers/md/dm-bufio.c:1238:1: warning: parameter names (without types) in function declaration [enabled by default]
drivers/md/dm-bufio.c:1245:1: warning: data definition has no type or storage class [enabled by default]
drivers/md/dm-bufio.c:1245:1: warning: type defaults to ‘int’ in declaration of ‘EXPORT_SYMBOL_GPL’ [-Wimplicit-int]
drivers/md/dm-bufio.c:1245:1: warning: parameter names (without types) in function declaration [enabled by default]
drivers/md/dm-bufio.c:1251:1: warning: data definition has no type or storage class [enabled by default]
drivers/md/dm-bufio.c:1251:1: warning: type defaults to ‘int’ in declaration of ‘EXPORT_SYMBOL_GPL’ [-Wimplicit-int]
drivers/md/dm-bufio.c:1251:1: warning: parameter names (without types) in function declaration [enabled by default]
drivers/md/dm-bufio.c:1257:1: warning: data definition has no type or storage class [enabled by default]
drivers/md/dm-bufio.c:1257:1: warning: type defaults to ‘int’ in declaration of ‘EXPORT_SYMBOL_GPL’ [-Wimplicit-int]
drivers/md/dm-bufio.c:1257:1: warning: parameter names (without types) in function declaration [enabled by default]
drivers/md/dm-bufio.c:1263:1: warning: data definition has no type or storage class [enabled by default]
drivers/md/dm-bufio.c:1263:1: warning: type defaults to ‘int’ in declaration of ‘EXPORT_SYMBOL_GPL’ [-Wimplicit-int]
drivers/md/dm-bufio.c:1263:1: warning: parameter names (without types) in function declaration [enabled by default]
drivers/md/dm-bufio.c:1269:1: warning: data definition has no type or storage class [enabled by default]
drivers/md/dm-bufio.c:1269:1: warning: type defaults to ‘int’ in declaration of ‘EXPORT_SYMBOL_GPL’ [-Wimplicit-int]
drivers/md/dm-bufio.c:1269:1: warning: parameter names (without types) in function declaration [enabled by default]
drivers/md/dm-bufio.c:1489:1: warning: data definition has no type or storage class [enabled by default]
drivers/md/dm-bufio.c:1489:1: warning: type defaults to ‘int’ in declaration of ‘EXPORT_SYMBOL_GPL’ [-Wimplicit-int]
drivers/md/dm-bufio.c:1489:1: warning: parameter names (without types) in function declaration [enabled by default]
drivers/md/dm-bufio.c:1534:1: warning: data definition has no type or storage class [enabled by default]
drivers/md/dm-bufio.c:1534:1: warning: type defaults to ‘int’ in declaration of ‘EXPORT_SYMBOL_GPL’ [-Wimplicit-int]
drivers/md/dm-bufio.c:1534:1: warning: parameter names (without types) in function declaration [enabled by default]
drivers/md/dm-bufio.c:1676:63: error: expected ‘)’ before ‘ulong’
drivers/md/dm-bufio.c:1677:40: error: expected ‘)’ before string constant
drivers/md/dm-bufio.c:1679:55: error: expected ‘)’ before ‘uint’
drivers/md/dm-bufio.c:1680:35: error: expected ‘)’ before string constant
drivers/md/dm-bufio.c:1682:67: error: expected ‘)’ before ‘ulong’
drivers/md/dm-bufio.c:1683:40: error: expected ‘)’ before string constant
drivers/md/dm-bufio.c:1685:79: error: expected ‘)’ before ‘ulong’
drivers/md/dm-bufio.c:1686:46: error: expected ‘)’ before string constant
drivers/md/dm-bufio.c:1688:87: error: expected ‘)’ before ‘ulong’
drivers/md/dm-bufio.c:1689:50: error: expected ‘)’ before string constant
drivers/md/dm-bufio.c:1691:73: error: expected ‘)’ before ‘ulong’
drivers/md/dm-bufio.c:1692:43: error: expected ‘)’ before string constant
drivers/md/dm-bufio.c:1694:73: error: expected ‘)’ before ‘ulong’
drivers/md/dm-bufio.c:1695:43: error: expected ‘)’ before string constant
drivers/md/dm-bufio.c:1697:15: error: expected declaration specifiers or ‘...’ before string constant
drivers/md/dm-bufio.c:1698:20: error: expected declaration specifiers or ‘...’ before string constant
drivers/md/dm-bufio.c:1699:16: error: expected declaration specifiers or ‘...’ before string constant
make[2]: *** [drivers/md/dm-bufio.o] Błąd 1
make[1]: *** [drivers/md] Błąd 2
make: *** [drivers] Błąd 2

COde is new, so it probably new bug not regression.

Regards,
Witek



-- 
Witold Baryluk


[Date Prev][Date Next]   [Thread Prev][Thread Next]   [Thread Index] [Date Index] [Author Index]