[Date Prev][Date Next]   [Thread Prev][Thread Next]   [Thread Index] [Date Index] [Author Index]

Compile Errors with e2fsprogs-1.24a



When I try to compile e2fsprogs-1.24a I receive the following snippet:

tillarium:/home/tilleyrw/downloads/ext3 Files/e2fsprogs-1.24a# mkdir build;cd 
build
tillarium:/home/tilleyrw/downloads/ext3 Files/e2fsprogs-1.24a/build# 
../configure
<<SNIP>>
./mk_cmds: Files/e2fsprogs-1.24a/lib/ss: No such file or directory
mk_cmds: Couldn't find mk_cmds's template files.
make[2]: *** [std_rqs.c] Error 1
make[2]: Leaving directory `/home/tilleyrw/downloads/ext3 
Files/e2fsprogs-1.24a/build/lib/ss'
make[1]: *** [all-libs-recursive] Error 1
make[1]: Leaving directory `/home/tilleyrw/downloads/ext3 
Files/e2fsprogs-1.24a/build'
make: *** [all] Error 2
tillarium:/home/tilleyrw/downloads/ext3 Files/e2fsprogs-1.24a/build#

Can anyone help me with this?  I am running on a Debian unstable box that is 
apt-get updated every 6 hours.
-- 
Robert Tilley, tilleyrw cfl rr com





[Date Prev][Date Next]   [Thread Prev][Thread Next]   [Thread Index] [Date Index] [Author Index]