[Date Prev][Date Next]   [Thread Prev][Thread Next]   [Thread Index] [Date Index] [Author Index]

Re: help make build



OK, I'm completely lost:

Jon Ciesla wrote:

> "TAG_OPTS=-F make tag".
TAG_OPTS=-F make tag
cvs tag -F -c uncrustify-0_35-1_fc7
? .build-0.35-1.fc7.log
? uncrustify-0.35
? uncrustify-0.35-1.fc7.src.rpm
? uncrustify-0.35.tgz
? x86_64
cvs tag: Tagging .
Tagged with: uncrustify-0_35-1_fc7

[nbecker nbecker4 F-7]$ cvs diff
? .build-0.35-1.fc7.log
? uncrustify-0.35
? uncrustify-0.35-1.fc7.src.rpm
? uncrustify-0.35.tgz
? x86_64
cvs diff: Diffing .
[nbecker nbecker4 F-7]$ make build
Created task: 71717
Task info: http://koji.fedoraproject.org/koji/taskinfo?taskID=71717
Watching tasks (this may be safely interrupted)...
71717 build (dist-fc7-updates-candidate, F-7:uncrustify-0_35-1_fc7): free
71717 build (dist-fc7-updates-candidate, F-7:uncrustify-0_35-1_fc7): free -> open (xenbuilder2.fedora.redhat.com)
  71719 buildSRPMFromCVS (F-7:uncrustify-0_35-1_fc7): open (xenbuilder4.fedora.phx.redhat.com)
  71719 buildSRPMFromCVS (F-7:uncrustify-0_35-1_fc7): open (xenbuilder4.fedora.phx.redhat.com) -> FAILED: BuildError: Error building SRPM
  0 free  1 open  0 done  1 failed
71717 build (dist-fc7-updates-candidate, F-7:uncrustify-0_35-1_fc7): open (xenbuilder2.fedora.redhat.com) -> FAILED: BuildError: Error building SRPM
  0 free  0 open  0 done  2 failed

71717 build (dist-fc7-updates-candidate, F-7:uncrustify-0_35-1_fc7) failed
make: *** [koji] Error 1


[Date Prev][Date Next]   [Thread Prev][Thread Next]   [Thread Index] [Date Index] [Author Index]