[Date Prev][Date Next]   [Thread Prev][Thread Next]   [Thread Index] [Date Index] [Author Index]

Sunbird Build Output (was Re: Sunbird in devel)



On Saturday, June 30, 2007 7:10 pm Rahul Sundaram wrote:
> You got to post the build output then.

Okay, the build output is attached here.

-- 
Please avoid sending me Word or PowerPoint attachments.
See http://www.gnu.org/philosophy/no-word-attachments.html
gmake[4]: Leaving directory `/home/kelly/rpmbuild/BUILD/mozilla/xpfe/components/autocomplete/public'
gmake[4]: Entering directory `/home/kelly/rpmbuild/BUILD/mozilla/xpfe/components/autocomplete/src'
gmake[4]: Leaving directory `/home/kelly/rpmbuild/BUILD/mozilla/xpfe/components/autocomplete/src'
gmake[3]: Leaving directory `/home/kelly/rpmbuild/BUILD/mozilla/xpfe/components/autocomplete'
gmake[3]: Entering directory `/home/kelly/rpmbuild/BUILD/mozilla/xpfe/components/console'
/home/kelly/rpmbuild/BUILD/mozilla/config/nsinstall -t -m 755 jsconsole-clhandler.js /var/tmp/sunbird-0.5-1.fc7-root-kelly/usr/lib/sunbird-0.5/components
gmake[3]: Leaving directory `/home/kelly/rpmbuild/BUILD/mozilla/xpfe/components/console'
gmake[3]: Entering directory `/home/kelly/rpmbuild/BUILD/mozilla/xpfe/components/history/public'
/home/kelly/rpmbuild/BUILD/mozilla/config/nsinstall -t -m 644 _xpidlgen/history.xpt /var/tmp/sunbird-0.5-1.fc7-root-kelly/usr/lib/sunbird-0.5/components
/home/kelly/rpmbuild/BUILD/mozilla/config/nsinstall -t -m 644 nsIBrowserHistory.idl /var/tmp/sunbird-0.5-1.fc7-root-kelly/usr/share/idl/sunbird-0.5
/home/kelly/rpmbuild/BUILD/mozilla/config/nsinstall -t -m 644 _xpidlgen/nsIBrowserHistory.h /var/tmp/sunbird-0.5-1.fc7-root-kelly/usr/include/sunbird-0.5/history
gmake[3]: Leaving directory `/home/kelly/rpmbuild/BUILD/mozilla/xpfe/components/history/public'
gmake[3]: Entering directory `/home/kelly/rpmbuild/BUILD/mozilla/xpfe/components/bookmarks/public'
/home/kelly/rpmbuild/BUILD/mozilla/config/nsinstall -t -m 644 _xpidlgen/bookmarks.xpt /var/tmp/sunbird-0.5-1.fc7-root-kelly/usr/lib/sunbird-0.5/components
/home/kelly/rpmbuild/BUILD/mozilla/config/nsinstall -t -m 644 nsIBookmarksService.idl /var/tmp/sunbird-0.5-1.fc7-root-kelly/usr/share/idl/sunbird-0.5
/home/kelly/rpmbuild/BUILD/mozilla/config/nsinstall -t -m 644 _xpidlgen/nsIBookmarksService.h /var/tmp/sunbird-0.5-1.fc7-root-kelly/usr/include/sunbird-0.5/appcomps
gmake[3]: Leaving directory `/home/kelly/rpmbuild/BUILD/mozilla/xpfe/components/bookmarks/public'
gmake[3]: Entering directory `/home/kelly/rpmbuild/BUILD/mozilla/xpfe/components/build2'
rm -f libappcomps.so
c++  -fno-rtti -fno-exceptions -Wall -Wconversion -Wpointer-arith -Wcast-align -Woverloaded-virtual -Wsynth -Wno-ctor-dtor-privacy -Wno-non-virtual-dtor -Wno-long-long -pedantic -fshort-wchar -pthread -pipe  -DNDEBUG -DTRIMMED -Os -g -pipe -Wp,-D_FORTIFY_SOURCE=2 -fexceptions -fstack-protector --param=ssp-buffer-size=4 -m32 -march=i386 -mtune=generic -fasynchronous-unwind-tables -fPIC -shared -Wl,-z,defs -Wl,-h,libappcomps.so -o libappcomps.so  nsModule.o    -Wl,-rpath,/usr/lib/sunbird-0.5   -Wl,--whole-archive ../../../dist/lib/libwindowds_s.a ../../../dist/lib/libautocomplete_s.a ../../../dist/lib/libappcompintl_s.a  -Wl,--no-whole-archive ../../../dist/lib/libunicharutil_s.a -L../../../dist/bin -lxpcom -lxpcom_core  -L../../../dist/bin -L/usr/lib -lplds4 -lplc4 -lnspr4 -lpthread -ldl  -L../../../dist/bin -lmozjs  -Wl,--version-script -Wl,../../../build/unix/gnu-ld-scripts/components-version-script -Wl,-Bsymbolic -ldl -lm
nsModule.o: In function `nsAutoCompleteItemConstructor':
/home/kelly/rpmbuild/BUILD/mozilla/xpfe/components/build2/nsModule.cpp:64: undefined reference to `nsAutoCompleteItem::nsAutoCompleteItem()'
nsModule.o: In function `nsAutoCompleteResultsConstructor':
/home/kelly/rpmbuild/BUILD/mozilla/xpfe/components/build2/nsModule.cpp:65: undefined reference to `nsAutoCompleteResults::nsAutoCompleteResults()'
collect2: ld returned 1 exit status
gmake[3]: *** [libappcomps.so] Error 1
gmake[3]: Leaving directory `/home/kelly/rpmbuild/BUILD/mozilla/xpfe/components/build2'
gmake[2]: *** [install] Error 2
gmake[2]: Leaving directory `/home/kelly/rpmbuild/BUILD/mozilla/xpfe/components'
gmake[1]: *** [install] Error 2
gmake[1]: Leaving directory `/home/kelly/rpmbuild/BUILD/mozilla/xpfe'
make: *** [install] Error 2
error: Bad exit status from /var/tmp/rpm-tmp.71709 (%install)


RPM build errors:
    Bad exit status from /var/tmp/rpm-tmp.71709 (%install)

[Date Prev][Date Next]   [Thread Prev][Thread Next]   [Thread Index] [Date Index] [Author Index]