[Date Prev][Date Next]   [Thread Prev][Thread Next]   [Thread Index] [Date Index] [Author Index]

[Fwd: Build Error (Job 2059): sdlmame-0129-0_6_0128u6_fc11 on fedora-development-rpmfusion_nonfree]



This is some fallout from the new RPM pkgconfig automatic deps, right?

Regards,
Julian

-------- Wiadomość oryginalna --------
Temat: Build Error (Job 2059): sdlmame-0129-0_6_0128u6_fc11 on
fedora-development-rpmfusion_nonfree
Data: Mon, 15 Dec 2008 11:23:10 +0100 (CET)
Nadawca: rpmfusion-buildsys lists rpmfusion org
Adresat: belegdol gmail com

Job failed on arch ppc64


         Build logs may be found at
http://buildsys.rpmfusion.org/logs/fedora-development-rpmfusion_nonfree/2059-sdlmame-0129-0.6.0128u6.fc11/


-------------------------------------------------

Package 'dbus-1', required by 'gconf', not found
Compiling src/osd/sdl/debug-intf.c...
Package dbus-1 was not found in the pkg-config search path.
Perhaps you should add the directory containing `dbus-1.pc'
to the PKG_CONFIG_PATH environment variable
Package 'dbus-1', required by 'gconf', not found
src/osd/sdl/dview.c:3:32: error: gconf/gconf-client.h: No such file or
directory
src/osd/sdl/dview.c: In function 'dview_class_init':
src/osd/sdl/dview.c:357: error: 'GConfClient' undeclared (first use in
this function)
src/osd/sdl/dview.c:357: error: (Each undeclared identifier is reported
only once
src/osd/sdl/dview.c:357: error: for each function it appears in.)
src/osd/sdl/dview.c:357: error: 'conf' undeclared (first use in this
function)
src/osd/sdl/dview.c:357: warning: implicit declaration of function
'gconf_client_get_default'
src/osd/sdl/dview.c:358: warning: ISO C90 forbids mixed declarations and
code
src/osd/sdl/dview.c:362: warning: implicit declaration of function
'gconf_client_get_string'
src/osd/sdl/dview.c:362: warning: assignment makes pointer from integer
without a cast
Compiling src/build/file2str.c...
make: *** [obj/sdl/mamed/osd/sdl/dview.o] Error 1
make: *** Waiting for unfinished jobs....
Package dbus-1 was not found in the pkg-config search path.
Perhaps you should add the directory containing `dbus-1.pc'
to the PKG_CONFIG_PATH environment variable
Package 'dbus-1', required by 'gconf', not found
src/build/file2str.c: In function 'main':
src/build/file2str.c:70: warning: ignoring return value of 'fread',
declared with attribute warn_unused_result
error: Bad exit status from /var/tmp/rpm-tmp.nnfOtp (%build)


RPM build errors:
    Bad exit status from /var/tmp/rpm-tmp.nnfOtp (%build)


[Date Prev][Date Next]   [Thread Prev][Thread Next]   [Thread Index] [Date Index] [Author Index]