[Date Prev][Date Next]   [Thread Prev][Thread Next]   [Thread Index] [Date Index] [Author Index]

Re: boost rebuild status



Current status:

aqsis-0:1.4.1-4.fc10.x86_64
aqsis-core-0:1.4.1-4.fc10.x86_64
  bump Release, rebuilt Nicolas Chauvet (kwizart)

asc-0:2.1.0.0-2.fc10.x86_64
  bump Release, rebuilt by Petr Machata

barry-0:0.14-4.fc10.x86_64
  bump Release, rebuilt by Petr Machata

bmpx-0:0.40.14-7.fc10.x86_64
  bump Release, rebuild fails on libtool. 
  Petr Machata fix offered, running autoreconf -i -f in %build, build passes.
  Ask maintainer.

chess-0:1.0-20.fc10.x86_64
  bump Release, rebuilt by Petr Machata

conexus-0:0.5.3-4.fc9.i386
conexus-0:0.5.3-4.fc9.x86_64
  bump Release, rebuilt by Petr Machata

deluge-0:1.0.5-1.fc10.x86_64
  bump Release, rebuilt by Petr Machata

fuse-encfs-0:1.5-1.fc10.x86_64
  bump Release, rebuilt by Petr Machata

glob2-0:0.9.3-1.fc10.x86_64
  bump Release, rebuilt by Petr Machata

gnash-0:0.8.4-3.fc10.x86_64
gnash-cygnal-0:0.8.4-3.fc10.x86_64
  bump Release, rebuilt by Kevin Kofler

HippoDraw-python-0:1.21.1-4.fc9.x86_64
  bump Release, rebuild fails:
  config fails boost, python debug?
  http://koji.fedoraproject.org/koji/taskinfo?taskID=1008532

hugin-0:0.7.0-1.fc10.x86_64
hugin-base-0:0.7.0-1.fc10.i386
  bump Release, rebuilt by Petr Machata

k3d-0:0.6.7.0-7.fc10.i386
  bump Release, rebuilt by Petr Machata

kdeedu-0:4.1.2-2.fc10.x86_64
  bump Release, rebuilt by Kevin Kofler

linkage-0:0.2.0-3.fc10.i386
  bump Release, rebuild fails
  http://koji.fedoraproject.org/koji/taskinfo?taskID=1008400

  rb_libtorrent deps fail?

mapnik-0:0.5.2-0.7.svn738.fc10.i386
mapnik-python-0:0.5.2-0.7.svn738.fc10.x86_64
mapnik-utils-0:0.5.2-0.7.svn738.fc10.x86_64
  bump Release, build fails:
  http://koji.fedoraproject.org/koji/taskinfo?taskID=1008473
  http://koji.fedoraproject.org/koji/taskinfo?taskID=1008570

  python/icuuc issues? 
  Could not find header or shared library for icuuc, exiting!

Miro-0:1.2.7-2.fc10.x86_64
  bump Release, rebuilt by Alex Lancaster (alexlan)

mkvtoolnix-0:2.4.0-1.fc10.x86_64
  bump Release, rebuilt.

openvrml-0:0.17.10-1.0.fc10.i386
openvrml-xembed-0:0.17.10-1.0.fc10.x86_64
  bump Release, scratch builds ok, rebuild fails only on ppc64, g++ killed ICE?:
  http://koji.fedoraproject.org/koji/taskinfo?taskID=1006133

pingus-0:0.7.2-3.fc9.x86_64
  bump Release, rebuilt.

player-0:2.1.1-5.fc10.x86_64
player-examples-0:2.1.1-5.fc10.x86_64
  bump Release, rebuild fails:
  
  compile error, temporary build situation?
  /usr/include/linux/serial.h:164: error: '__u32' does not name a type
  http://koji.fedoraproject.org/koji/taskinfo?taskID=1007777
  
  Tim Niemueller on it.

pyexiv2-0:0.1.2-4.fc10.x86_64
  rebuild fails:
  http://koji.fedoraproject.org/koji/getfile?taskID=1007372

  boost_python? 
  g++ -o build/libpyexiv2.os -c -O2 -g -pipe -Wall -Wp,-D_FORTIFY_SOURCE=2 -fexceptions -fstack-protector --param=ssp-buffer-size=4 -m64 -mtune=generic -fPIC -I/usr/include/python2.6 src/libpyexiv2.cpp
src/libpyexiv2.cpp: In member function 'boost::python::tuple LibPyExiv2::Image::getThumbnailData()':
src/libpyexiv2.cpp:312: error: 'Exiv2::Thumbnail' has not been declared
src/libpyexiv2.cpp:312: error: expected `;' before 'thumbnail'
src/libpyexiv2.cpp:313: error: 'thumbnail' was not declared in this scope

python-tag-0:0.94.1-1.fc10.x86_64
  bump Release, rebuilt.

qmf-0:0.3.705289-1.fc10.x86_64
qpidc-0:0.3.705289-1.fc10.i386
qpidc-perftest-0:0.3.705289-1.fc10.x86_64
qpidc-rdma-0:0.3.705289-1.fc10.i386
qpidd-0:0.3.722557-1.fc10.x86_64
qpidd-cluster-0:0.3.705289-1.fc10.x86_64
qpidd-rdma-0:0.3.705289-1.fc10.x86_64
  bump Release, rebuild fails, not consistent.

  libtool issue?
  http://koji.fedoraproject.org/koji/getfile?taskID=1006101&name=build.log

libtool: install: invalid libtool wrapper script `perftest'
error: Bad exit status from /var/tmp/rpm-tmp.dOuDVz (%install)
RPM build errors:
    Bad exit status from /var/tmp/rpm-tmp.dOuDVz (%install)
Child returncode was: 1
EXCEPTION: Command failed. See logs for output.
 # ['bash', '--login', '-c', 'rpmbuild -bb --target x86_64 --nodeps builddir/build/SPECS/qpidc.spec']
Traceback (most recent call last):
  File "/usr/lib/python2.4/site-packages/mock/trace_decorator.py", line 70, in trace
    result = func(*args, **kw)
  File "/usr/lib/python2.4/site-packages/mock/util.py", line 316, in do
    raise mock.exception.Error, ("Command failed. See logs for output.\n # %s" % (command,), child.returncode)
Error: Command failed. See logs for output.
 # ['bash', '--login', '-c', 'rpmbuild -bb --target x86_64 --nodeps builddir/build/SPECS/qpidc.spec']
LEAVE do --> EXCEPTION RAISED

QuantLib-test-0:0.9.0-5.fc10.x86_64
  bump Release, rebuilt
  Note no boost libs in Requires in binary files.

rb_libtorrent-0:0.13.1-3.fc10.x86_64
rb_libtorrent-python-0:0.13.1-3.fc10.x86_64
  bump Release, failed:
  configuration error with boost system library
  http://koji.fedoraproject.org/koji/getfile?taskID=1005216&name=build.log

  add --with-boost-system=mt to %configure, still compile fail:
  http://koji.fedoraproject.org/koji/taskinfo?taskID=1006006

In file included from disk_io_thread.cpp:35:
../include/libtorrent/disk_io_thread.hpp:135: error: 'condition' in namespace 'boost' does not name a type
disk_io_thread.cpp: In member function 'void libtorrent::disk_io_thread::join()':
disk_io_thread.cpp:97: error: 'm_signal' was not declared in this scope
disk_io_thread.cpp: In member function 'void libtorrent::disk_io_thread::stop(boost::intrusive_ptr<libtorrent::piece_manager>)':
disk_io_thread.cpp:124: error: 'm_signal' was not declared in this scope
disk_io_thread.cpp: In member function 'void libtorrent::disk_io_thread::add_job(const libtorrent::disk_io_job&, const boost::function<void ()(int, const libtorrent::disk_io_job&)>&)':
disk_io_thread.cpp:209: error: 'm_signal' was not declared in this scope
disk_io_thread.cpp: In member function 'void libtorrent::disk_io_thread::operator()()':
disk_io_thread.cpp:243: error: 'm_signal' was not declared in this scope

  bump base sources to 0.14.1, configure ok, compile ok, link fails, 
  boost_system vs zlib.
  Ask maintainer.

rcsslogplayer-13.1.0-2.fc11.src.rpm
  bump Release, rebuilt

rcssbase-0:12.1.2-1.fc10.x86_64
rcssserver-0:12.1.4-1.fc10.i386
  bump Release, rebuilt

rcssserver3d-0:0.6-5.fc10.i386
  bump Release, rebuild fails:
  compile error  
  http://koji.fedoraproject.org/koji/taskinfo?taskID=1008370
  
In file included from corecontext.cpp:25:
node.h: In member function 'boost::weak_ptr<T> zeitgeist::Leaf::FindParentSupportingClass() const':
node.h:135: error: there are no arguments to 'make_shared' that depend on a template parameter, so a declaration of 'make_shared' must be available
node.h:135: error: (if you use '-fpermissive', G++ will accept your code, but allowing the use of an undeclared name is deprecated)
class.cpp: In member function 'boost::shared_ptr<zeitgeist::Object> zeitgeist::Class::Create()':
class.cpp:65: error: 'make_shared' was not declared in this scope
class.cpp: In member function 'boost::shared_ptr<zeitgeist::Core> zeitgeist::Class::GetCore() const':
class.cpp:88: error: 'make_shared' was not declared in this scope
In file included from core.cpp:26:
node.h: In member function 'boost::weak_ptr<T> zeitgeist::Leaf::FindParentSupportingClass() const':
node.h:135: error: there are no arguments to 'make_shared' that depend on a template parameter, so a declaration of 'make_shared' must be available
node.h:135: error: (if you use '-fpermissive', G++ will accept your code, but allowing the use of an undeclared name is deprecated)
make[3]: *** [libzeitgeist_la-corecontext.lo] Error 1

referencer-0:1.1.4-1.fc10.x86_64
  bump Release, rebuilt

smc-0:1.5-3.fc10.x86_64
  no devel package?

source-highlight-0:2.10-1.fc10.x86_64
  bump Release, rebuilt

twinkle-0:1.3.2-1.fc10.x86_64
  bump Release, rebuilt

vegastrike-0:0.5.0-5.fc10.x86_64
  bump Release, rebuild fails:
  http://koji.fedoraproject.org/koji/getfile?taskID=1005464&name=build.log

  boost_python compile error
/usr/include/boost/python/detail/caller.hpp:102: error: 'struct boost::python::detail::caller_arity<1u>::impl<F, Policies, Sig>::operator()(PyObject*, PyObject*) [with F = Vector (*)(int), Policies = boost::python::default_call_policies, Sig = boost::mpl::vector2<Vector, int>]::result_converter' has no member named 'get_pytype'

wesnoth-0:1.4.5-1.fc10.x86_64
wesnoth-server-0:1.4.5-1.fc10.x86_64
wesnoth-tools-0:1.4.5-1.fc10.x86_64
  bump Release, rebuilt

wp_tray-0:0.5.3-8.fc10.x86_64
  bump Release, rebuilt

xmms2-0:0.5-2.fc10.x86_64
  bump Release, rebuilt


[Date Prev][Date Next]   [Thread Prev][Thread Next]   [Thread Index] [Date Index] [Author Index]