[Date Prev][Date Next]   [Thread Prev][Thread Next]   [Thread Index] [Date Index] [Author Index]

gcc-4.3 build failure of bonnie++



bonnie++ hasn't changed in many years now.

http://koji.fedoraproject.org/koji/getfile?taskID=405053&name=build.log
g++ -O2 -DNDEBUG -Wall -W -Wshadow -Wpointer-arith -Wwrite-strings -pedantic -ffor-scope -O2 -g -pipe -Wall -Wp,-D_FORTIFY_SOURCE=2 -fexceptions -fstack-protector --param=ssp-buffer-size=4 -m32 zcav.cpp -o zcav bon_suid.o
zcav.cpp: In function 'int main(int, char**)':
zcav.cpp:73: error: 'strdup' was not declared in this scope
zcav.cpp:75: warning: suggest a space before ';' or explicit braces around empty body in 'for' statement
zcav.cpp:112: error: 'strcmp' was not declared in this scope
make: *** [zcav] Error 1
make: *** Waiting for unfinished jobs....
error: Bad exit status from /var/tmp/rpm-tmp.62211 (%build)


[Date Prev][Date Next]   [Thread Prev][Thread Next]   [Thread Index] [Date Index] [Author Index]