[Date Prev][Date Next]   [Thread Prev][Thread Next]   [Thread Index] [Date Index] [Author Index]

[buildsys@fedoraproject.org: Build Error (Job 26895): torque-2_1_6-2_fc7 on fedora-development-extras]



Any TCL experts around?  I've never seen this error message before, and
google doesn't find much.

I'm just doing a rebuild because of tcl8.5 with no other changes.  It
builds fine under mock with fedora-devel-i386, but fails all 3 arches in
plague.  I even confirmed my fake root was using the same nvr tcl/tk
packages as plague.

http://buildsys.fedoraproject.org/logs/fedora-development-extras/26895-torque-2.1.6-2.fc7/

-- 
Garrick Staples, Linux/HPCC Administrator
University of Southern California
--- Begin Message ---
Job failed on arch i386


         Build logs may be found at http://buildsys.fedoraproject.org/logs/fedora-development-extras/26895-torque-2.1.6-2.fc7/


-------------------------------------------------

creating pbs_tclsh
gcc -I../../src/include -DPBS_SERVER_HOME=\"/var/torque\" -O2 -g -pipe -Wall -Wp,-D_FORTIFY_SOURCE=2 -fexceptions -fstack-protector --param=ssp-buffer-size=4 -m32 -march=i386 -mtune=generic -fasynchronous-unwind-tables -D_LARGEFILE64_SOURCE -o .libs/pbs_wish pbsTkInit.o pbs_tclWrap.o site_tclWrap.o  ../lib/Libpbs/.libs/libtorque.so -L/usr/lib -ltk8.5 -lX11 -ltcl8.5 -ldl -lpthread -lieee -lm
creating pbs_wish
make[3]: Leaving directory `/builddir/build/BUILD/torque-2.1.6/src/tools'
Making all in xpbsmon
make[3]: Entering directory `/builddir/build/BUILD/torque-2.1.6/src/tools/xpbsmon'
sed -e 's,#\!.*pbs_wish.*$,#\!/usr/bin/pbs_wish -f,' \
	    -e 's,set  *libdir.*$,set libdir /usr/lib/xpbsmon,' \
	    -e 's,set  *appdefdir.*$,set appdefdir /usr/lib/xpbsmon,' \
	    xpbsmon.src > xpbsmon
/bin/sh ./patch_scripts "linux" "localhost" "xpbsmonrc.src" "xpbsmonrc"
Processing buildindex
Running buildindex (locally)
application-specific initialization failed: too many nested evaluations (infinite loop?)
too many nested evaluations (infinite loop?)
    while executing
"set libdir [lindex $argv 0]"
    (file "./buildindex" line 89)
make[3]: *** [tclIndex] Error 1
make[3]: Leaving directory `/builddir/build/BUILD/torque-2.1.6/src/tools/xpbsmon'
make[2]: *** [all-recursive] Error 1
make[2]: Leaving directory `/builddir/build/BUILD/torque-2.1.6/src/tools'
make[1]: *** [all-recursive] Error 1
make[1]: Leaving directory `/builddir/build/BUILD/torque-2.1.6/src'
make: *** [all-recursive] Error 1
error: Bad exit status from /var/tmp/rpm-tmp.66539 (%build)


RPM build errors:
    Bad exit status from /var/tmp/rpm-tmp.66539 (%build)


--- End Message ---

Attachment: pgpSPzmLsm6pz.pgp
Description: PGP signature


[Date Prev][Date Next]   [Thread Prev][Thread Next]   [Thread Index] [Date Index] [Author Index]