[Date Prev][Date Next]   [Thread Prev][Thread Next]   [Thread Index] [Date Index] [Author Index]

Re: Novell/Ximian Connector For Evolution GPL'd

On Wed, 2004-05-12 at 22:44 -0400, David Malcolm wrote:
> OK - I've built the Ximian/Evolution Connector and put up a Yum
> repository here; it works for me on my FC2 rawhide with Evolution 1.4:
> http://people.redhat.com/dmalcolm/evo-1-4-connector

Interestingly enough, I get the same error trying to compile this rpm
for x86_64 as I did with evolution 1.5.7

[root d-mpk14-95-238 SPECS]# rpmbuild -ba evolution-connector.spec


gcc -O2 -g -pipe -Wall -Wmissing-prototypes -Wnested-externs -Wpointer-arith -Wno-sign-compare -o fbtest fbtest.o -Wl,--export-dynamic -Wl,--export-dynamic  libexchange.a ../xntlm/libxntlm.a -L/usr/lib64/evolution/1.4 -lsoup-2.0 -pthread -lpcs -lcal-util -lcal-client -lical-evolution -lwombat -leutil -lgnome-2 /usr/lib/libpopt.so -lgal-2.0 -lgal-a11y-2.0 -lbonobo-2 -lgconf-2 -lgnomevfs-2 -lglade-2.0 -lgnomeprint-2-2 -lgtk-x11-2.0 -lgdk-x11-2.0 -latk-1.0 -lgdk_pixbuf-2.0 -lpangoxft-1.0 -lpangox-1.0 -lart_lgpl_2 -lxml2 -lpthread -lz -lpango-1.0 -lbonobo-activation -lORBit-2 -lgobject-2.0 -lgthread-2.0 -lm -lgmodule-2.0 -ldl -lglib-2.0 -lldap -llber -lnsl
/usr/lib/libpopt.so: could not read symbols: Invalid operation
collect2: ld returned 1 exit status
make[2]: *** [fbtest] Error 1
make[2]: Leaving directory `/usr/src/redhat/BUILD/ximian-connector-1.4.7/lib'
make[1]: *** [all-recursive] Error 1
make[1]: Leaving directory `/usr/src/redhat/BUILD/ximian-connector-1.4.7'
make: *** [all-recursive-am] Error 2
error: Bad exit status from /var/tmp/rpm-tmp.68499 (%build)

RPM build errors:
    Bad exit status from /var/tmp/rpm-tmp.68499 (%build)

Attachment: signature.asc
Description: This is a digitally signed message part

[Date Prev][Date Next]   [Thread Prev][Thread Next]   [Thread Index] [Date Index] [Author Index]