[Date Prev][Date Next]   [Thread Prev][Thread Next]   [Thread Index] [Date Index] [Author Index]

Re: ppc and x86_64 testing request





On 3/14/06, Michael A. Peters <mpeters mac com> wrote:
Request for fc5test3 on ppc and x86_64

silgraphite is a font engine for non latin script fonts.

The project is getting ready for 2.0 release.
The developers want 2.0 to work in FC5 w/o needing patching.
It currently does on x86. I can not test on ppc/x86_64

If you have a ppc/x86_64 machine running FC5Test3 and you would like to
help, please do the following:

0) make sure your pango (and pango-devel) packages are current

1) grab my src.rpm from:

http://mpeters.us/silgraphite/

2) Install the Doulis SIL font.
Link to download on page above.

It hasn't yet been packaged for Fedora, I'll be submitting a spec file
to Extras soon. But in the mean time, just throw it in ~/.fonts and run
fc-cache

3) rebuild the src.rpm

If there is a compile error, and I hope there isn't, you can report it
to the sourceforge project:

http://sourceforge.net/tracker/?group_id=66144&atid=513479

or to me

https://bugzilla.redhat.com/bugzilla/show_bug.cgi?id=176071

4) If build completes, install the resulting silgraphite and
pango-silgraphite rpm's

5) use the sil.txt file on the http://mpeters.us/silgraphite/ page (link
at bottom)

Opening the file with gedit, it should look like the lower image.
If you get to step five - please notify whether it works or not at

https://bugzilla.redhat.com/bugzilla/show_bug.cgi?id=176071

(if it doesn't work, it *may* be a packaging error on my part - due to
multilib, some macros that are arch specific are set)

Thank you.

-=-
silgraphite and the various SIL fonts that use it will allow inexpensive
computers running Linux to be used in 3rd world countries allowing the
native languages of the people in those countries to be properly
displayed and used. Inexpensive likely means x86 (which does work) but
it still would be nice if any ppc/x86_64 issues with fc5 are known
before they do final release.

--
fedora-test-list mailing list
fedora-test-list redhat com
To unsubscribe:
https://www.redhat.com/mailman/listinfo/fedora-test-list


Here is as much as I could get from my terminal of rpmbuild that failed on x86_64
d.h:49: error: declaration of 'struct std::allocator<char>'
/usr/lib/gcc/x86_64-redhat-linux/4.1.0/../../../../include/c++/4.1.0/bits/basic_string.tcc:450: error: invalid use of undefined type 'struct std::allocator<char>'
/usr/lib/gcc/x86_64-redhat-linux/4.1.0/../../../../include/c++/4.1.0/bits/stringfwd.h:49: error: declaration of 'struct std::allocator<char>'
/usr/lib/gcc/x86_64-redhat-linux/4.1.0/../../../../include/c++/4.1.0/bits/basic_string.tcc:196: error: invalid use of undefined type 'struct std::allocator<char>'
/usr/lib/gcc/x86_64-redhat-linux/4.1.0/../../../../include/c++/4.1.0/bits/stringfwd.h:49: error: declaration of 'struct std::allocator<char>'
/usr/lib/gcc/x86_64-redhat-linux/4.1.0/../../../../include/c++/4.1.0/bits/basic_string.tcc:207: error: invalid use of undefined type 'struct std::allocator<char>'
/usr/lib/gcc/x86_64-redhat-linux/4.1.0/../../../../include/c++/4.1.0/bits/stringfwd.h:49: error: declaration of 'struct std::allocator<char>'
/usr/lib/gcc/x86_64-redhat-linux/4.1.0/../../../../include/c++/4.1.0/bits/basic_string.tcc:218: error: invalid use of undefined type 'struct std::allocator<char>'
/usr/lib/gcc/x86_64-redhat-linux/4.1.0/../../../../include/c++/4.1.0/bits/stringfwd.h:49: error: declaration of 'struct std::allocator<char>'
/usr/lib/gcc/x86_64-redhat-linux/4.1.0/../../../../include/c++/4.1.0/bits/basic_string.tcc:232: error: invalid use of undefined type 'struct std::allocator<char>'
/usr/lib/gcc/x86_64-redhat-linux/4.1.0/../../../../include/c++/4.1.0/bits/stringfwd.h:49: error: declaration of 'struct std::allocator<char>'
/usr/lib/gcc/x86_64-redhat-linux/4.1.0/../../../../include/c++/4.1.0/bits/basic_string.h:516: error: invalid use of undefined type 'struct std::allocator<char>'
/usr/lib/gcc/x86_64-redhat-linux/4.1.0/../../../../include/c++/4.1.0/bits/stringfwd.h:49: error: declaration of 'struct std::allocator<char>'
/usr/lib/gcc/x86_64-redhat-linux/4.1.0/../../../../include/c++/4.1.0/bits/basic_string.h:527: error: invalid use of undefined type 'struct std::allocator<char>'
/usr/lib/gcc/x86_64-redhat-linux/4.1.0/../../../../include/c++/4.1.0/bits/stringfwd.h:49: error: declaration of 'struct std::allocator<char>'
/usr/lib/gcc/x86_64-redhat-linux/4.1.0/../../../../include/c++/4.1.0/bits/basic_string.h:535: error: invalid use of undefined type 'struct std::allocator<char>'
/usr/lib/gcc/x86_64-redhat-linux/4.1.0/../../../../include/c++/4.1.0/bits/stringfwd.h:49: error: declaration of 'struct std::allocator<char>'
/usr/lib/gcc/x86_64-redhat-linux/4.1.0/../../../../include/c++/4.1.0/bits/basic_string.h:546: error: invalid use of undefined type 'struct std::allocator<char>'
/usr/lib/gcc/x86_64-redhat-linux/4.1.0/../../../../include/c++/4.1.0/bits/stringfwd.h:49: error: declaration of 'struct std::allocator<char>'
/usr/lib/gcc/x86_64-redhat-linux/4.1.0/../../../../include/c++/4.1.0/bits/basic_string.h:555: error: invalid use of undefined type 'struct std::allocator<char>'
/usr/lib/gcc/x86_64-redhat-linux/4.1.0/../../../../include/c++/4.1.0/bits/stringfwd.h:49: error: declaration of 'struct std::allocator<char>'
/usr/lib/gcc/x86_64-redhat-linux/4.1.0/../../../../include/c++/4.1.0/bits/basic_string.h:564: error: invalid use of undefined type 'struct std::allocator<char>'
/usr/lib/gcc/x86_64-redhat-linux/4.1.0/../../../../include/c++/4.1.0/bits/stringfwd.h:49: error: declaration of 'struct std::allocator<char>'
/usr/lib/gcc/x86_64-redhat-linux/4.1.0/../../../../include/c++/4.1.0/bits/basic_string.h:573: error: invalid use of undefined type 'struct std::allocator<char>'
/usr/lib/gcc/x86_64-redhat-linux/4.1.0/../../../../include/c++/4.1.0/bits/stringfwd.h:49: error: declaration of 'struct std::allocator<char>'
/usr/lib/gcc/x86_64-redhat-linux/4.1.0/../../../../include/c++/4.1.0/bits/basic_string.h:582: error: invalid use of undefined type 'struct std::allocator<char>'
/usr/lib/gcc/x86_64-redhat-linux/4.1.0/../../../../include/c++/4.1.0/bits/stringfwd.h:49: error: declaration of 'struct std::allocator<char>'
/usr/lib/gcc/x86_64-redhat-linux/4.1.0/../../../../include/c++/4.1.0/bits/basic_string.h:590: error: invalid use of undefined type 'struct std::allocator<char>'
/usr/lib/gcc/x86_64-redhat-linux/4.1.0/../../../../include/c++/4.1.0/bits/stringfwd.h:49: error: declaration of 'struct std::allocator<char>'
/usr/lib/gcc/x86_64-redhat-linux/4.1.0/../../../../include/c++/4.1.0/bits/basic_string.h:596: error: invalid use of undefined type 'struct std::allocator<char>'
/usr/lib/gcc/x86_64-redhat-linux/4.1.0/../../../../include/c++/4.1.0/bits/stringfwd.h:49: error: declaration of 'struct std::allocator<char>'
/usr/lib/gcc/x86_64-redhat-linux/4.1.0/../../../../include/c++/4.1.0/bits/basic_string.h:601: error: invalid use of undefined type 'struct std::allocator<char>'
/usr/lib/gcc/x86_64-redhat-linux/4.1.0/../../../../include/c++/4.1.0/bits/stringfwd.h:49: error: declaration of 'struct std::allocator<char>'
/usr/lib/gcc/x86_64-redhat-linux/4.1.0/../../../../include/c++/4.1.0/bits/basic_string.tcc:613: error: invalid use of undefined type 'struct std::allocator<char>'
/usr/lib/gcc/x86_64-redhat-linux/4.1.0/../../../../include/c++/4.1.0/bits/stringfwd.h:49: error: declaration of 'struct std::allocator<char>'
/usr/lib/gcc/x86_64-redhat-linux/4.1.0/../../../../include/c++/4.1.0/bits/basic_string.h:628: error: invalid use of undefined type 'struct std::allocator<char>'
/usr/lib/gcc/x86_64-redhat-linux/4.1.0/../../../../include/c++/4.1.0/bits/stringfwd.h:49: error: declaration of 'struct std::allocator<char>'
/usr/lib/gcc/x86_64-redhat-linux/4.1.0/../../../../include/c++/4.1.0/bits/basic_string.h:636: error: invalid use of undefined type 'struct std::allocator<char>'
/usr/lib/gcc/x86_64-redhat-linux/4.1.0/../../../../include/c++/4.1.0/bits/stringfwd.h:49: error: declaration of 'struct std::allocator<char>'
/usr/lib/gcc/x86_64-redhat-linux/4.1.0/../../../../include/c++/4.1.0/bits/basic_string.tcc:483: error: invalid use of undefined type 'struct std::allocator<char>'
/usr/lib/gcc/x86_64-redhat-linux/4.1.0/../../../../include/c++/4.1.0/bits/stringfwd.h:49: error: declaration of 'struct std::allocator<char>'
/usr/lib/gcc/x86_64-redhat-linux/4.1.0/../../../../include/c++/4.1.0/bits/basic_string.h:685: error: invalid use of undefined type 'struct std::allocator<char>'
/usr/lib/gcc/x86_64-redhat-linux/4.1.0/../../../../include/c++/4.1.0/bits/stringfwd.h:49: error: declaration of 'struct std::allocator<char>'
/usr/lib/gcc/x86_64-redhat-linux/4.1.0/../../../../include/c++/4.1.0/bits/basic_string.h:702: error: invalid use of undefined type 'struct std::allocator<char>'
/usr/lib/gcc/x86_64-redhat-linux/4.1.0/../../../../include/c++/4.1.0/bits/stringfwd.h:49: error: declaration of 'struct std::allocator<char>'
/usr/lib/gcc/x86_64-redhat-linux/4.1.0/../../../../include/c++/4.1.0/bits/basic_string.h:723: error: invalid use of undefined type 'struct std::allocator<char>'
/usr/lib/gcc/x86_64-redhat-linux/4.1.0/../../../../include/c++/4.1.0/bits/stringfwd.h:49: error: declaration of 'struct std::allocator<char>'
/usr/lib/gcc/x86_64-redhat-linux/4.1.0/../../../../include/c++/4.1.0/bits/basic_string.h:742: error: invalid use of undefined type 'struct std::allocator<char>'
/usr/lib/gcc/x86_64-redhat-linux/4.1.0/../../../../include/c++/4.1.0/bits/stringfwd.h:49: error: declaration of 'struct std::allocator<char>'
/usr/lib/gcc/x86_64-redhat-linux/4.1.0/../../../../include/c++/4.1.0/bits/basic_string.tcc:346: error: invalid use of undefined type 'struct std::allocator<char>'
/usr/lib/gcc/x86_64-redhat-linux/4.1.0/../../../../include/c++/4.1.0/bits/stringfwd.h:49: error: declaration of 'struct std::allocator<char>'
/usr/lib/gcc/x86_64-redhat-linux/4.1.0/../../../../include/c++/4.1.0/bits/basic_string.tcc:302: error: invalid use of undefined type 'struct std::allocator<char>'
/usr/lib/gcc/x86_64-redhat-linux/4.1.0/../../../../include/c++/4.1.0/bits/stringfwd.h:49: error: declaration of 'struct std::allocator<char>'
/usr/lib/gcc/x86_64-redhat-linux/4.1.0/../../../../include/c++/4.1.0/bits/basic_string.tcc:285: error: invalid use of undefined type 'struct std::allocator<char>'
/usr/lib/gcc/x86_64-redhat-linux/4.1.0/../../../../include/c++/4.1.0/bits/stringfwd.h:49: error: declaration of 'struct std::allocator<char>'
/usr/lib/gcc/x86_64-redhat-linux/4.1.0/../../../../include/c++/4.1.0/bits/basic_string.h:884: error: invalid use of undefined type 'struct std::allocator<char>'
/usr/lib/gcc/x86_64-redhat-linux/4.1.0/../../../../include/c++/4.1.0/bits/stringfwd.h:49: error: declaration of 'struct std::allocator<char>'
/usr/lib/gcc/x86_64-redhat-linux/4.1.0/../../../../include/c++/4.1.0/bits/basic_string.tcc:263: error: invalid use of undefined type 'struct std::allocator<char>'
/usr/lib/gcc/x86_64-redhat-linux/4.1.0/../../../../include/c++/4.1.0/bits/stringfwd.h:49: error: declaration of 'struct std::allocator<char>'
/usr/lib/gcc/x86_64-redhat-linux/4.1.0/../../../../include/c++/4.1.0/bits/basic_string.h:928: error: invalid use of undefined type 'struct std::allocator<char>'
/usr/lib/gcc/x86_64-redhat-linux/4.1.0/../../../../include/c++/4.1.0/bits/stringfwd.h:49: error: declaration of 'struct std::allocator<char>'
/usr/lib/gcc/x86_64-redhat-linux/4.1.0/../../../../include/c++/4.1.0/bits/basic_string.h:957: error: invalid use of undefined type 'struct std::allocator<char>'
/usr/lib/gcc/x86_64-redhat-linux/4.1.0/../../../../include/c++/4.1.0/bits/stringfwd.h:49: error: declaration of 'struct std::allocator<char>'
/usr/lib/gcc/x86_64-redhat-linux/4.1.0/../../../../include/c++/4.1.0/bits/basic_string.h:973: error: invalid use of undefined type 'struct std::allocator<char>'
/usr/lib/gcc/x86_64-redhat-linux/4.1.0/../../../../include/c++/4.1.0/bits/stringfwd.h:49: error: declaration of 'struct std::allocator<char>'
/usr/lib/gcc/x86_64-redhat-linux/4.1.0/../../../../include/c++/4.1.0/bits/basic_string.h:988: error: invalid use of undefined type 'struct std::allocator<char>'
/usr/lib/gcc/x86_64-redhat-linux/4.1.0/../../../../include/c++/4.1.0/bits/stringfwd.h:49: error: declaration of 'struct std::allocator<char>'
/usr/lib/gcc/x86_64-redhat-linux/4.1.0/../../../../include/c++/4.1.0/bits/basic_string.h:1011: error: invalid use of undefined type 'struct std::allocator<char>'
/usr/lib/gcc/x86_64-redhat-linux/4.1.0/../../../../include/c++/4.1.0/bits/stringfwd.h:49: error: declaration of 'struct std::allocator<char>'
/usr/lib/gcc/x86_64-redhat-linux/4.1.0/../../../../include/c++/4.1.0/bits/basic_string.tcc:364: error: invalid use of undefined type 'struct std::allocator<char>'
/usr/lib/gcc/x86_64-redhat-linux/4.1.0/../../../../include/c++/4.1.0/bits/stringfwd.h:49: error: declaration of 'struct std::allocator<char>'
/usr/lib/gcc/x86_64-redhat-linux/4.1.0/../../../../include/c++/4.1.0/bits/basic_string.h:1051: error: invalid use of undefined type 'struct std::allocator<char>'
/usr/lib/gcc/x86_64-redhat-linux/4.1.0/../../../../include/c++/4.1.0/bits/stringfwd.h:49: error: declaration of 'struct std::allocator<char>'
/usr/lib/gcc/x86_64-redhat-linux/4.1.0/../../../../include/c++/4.1.0/bits/basic_string.h:1074: error: invalid use of undefined type 'struct std::allocator<char>'
/usr/lib/gcc/x86_64-redhat-linux/4.1.0/../../../../include/c++/4.1.0/bits/stringfwd.h:49: error: declaration of 'struct std::allocator<char>'
/usr/lib/gcc/x86_64-redhat-linux/4.1.0/../../../../include/c++/4.1.0/bits/basic_string.h:1091: error: invalid use of undefined type 'struct std::allocator<char>'
/usr/lib/gcc/x86_64-redhat-linux/4.1.0/../../../../include/c++/4.1.0/bits/stringfwd.h:49: error: declaration of 'struct std::allocator<char>'
/usr/lib/gcc/x86_64-redhat-linux/4.1.0/../../../../include/c++/4.1.0/bits/basic_string.h:1115: error: invalid use of undefined type 'struct std::allocator<char>'
/usr/lib/gcc/x86_64-redhat-linux/4.1.0/../../../../include/c++/4.1.0/bits/stringfwd.h:49: error: declaration of 'struct std::allocator<char>'
/usr/lib/gcc/x86_64-redhat-linux/4.1.0/../../../../include/c++/4.1.0/bits/basic_string.h:1131: error: invalid use of undefined type 'struct std::allocator<char>'
/usr/lib/gcc/x86_64-redhat-linux/4.1.0/../../../../include/c++/4.1.0/bits/stringfwd.h:49: error: declaration of 'struct std::allocator<char>'
/usr/lib/gcc/x86_64-redhat-linux/4.1.0/../../../../include/c++/4.1.0/bits/basic_string.h:1151: error: invalid use of undefined type 'struct std::allocator<char>'
/usr/lib/gcc/x86_64-redhat-linux/4.1.0/../../../../include/c++/4.1.0/bits/stringfwd.h:49: error: declaration of 'struct std::allocator<char>'
/usr/lib/gcc/x86_64-redhat-linux/4.1.0/../../../../include/c++/4.1.0/bits/basic_string.h:1178: error: invalid use of undefined type 'struct std::allocator<char>'
/usr/lib/gcc/x86_64-redhat-linux/4.1.0/../../../../include/c++/4.1.0/bits/stringfwd.h:49: error: declaration of 'struct std::allocator<char>'
/usr/lib/gcc/x86_64-redhat-linux/4.1.0/../../../../include/c++/4.1.0/bits/basic_string.h:1201: error: invalid use of undefined type 'struct std::allocator<char>'
/usr/lib/gcc/x86_64-redhat-linux/4.1.0/../../../../include/c++/4.1.0/bits/stringfwd.h:49: error: declaration of 'struct std::allocator<char>'
/usr/lib/gcc/x86_64-redhat-linux/4.1.0/../../../../include/c++/4.1.0/bits/basic_string.tcc:396: error: invalid use of undefined type 'struct std::allocator<char>'
/usr/lib/gcc/x86_64-redhat-linux/4.1.0/../../../../include/c++/4.1.0/bits/stringfwd.h:49: error: declaration of 'struct std::allocator<char>'
/usr/lib/gcc/x86_64-redhat-linux/4.1.0/../../../../include/c++/4.1.0/bits/basic_string.h:1243: error: invalid use of undefined type 'struct std::allocator<char>'
/usr/lib/gcc/x86_64-redhat-linux/4.1.0/../../../../include/c++/4.1.0/bits/stringfwd.h:49: error: declaration of 'struct std::allocator<char>'
/usr/lib/gcc/x86_64-redhat-linux/4.1.0/../../../../include/c++/4.1.0/bits/basic_string.h:1266: error: invalid use of undefined type 'struct std::allocator<char>'
/usr/lib/gcc/x86_64-redhat-linux/4.1.0/../../../../include/c++/4.1.0/bits/stringfwd.h:49: error: declaration of 'struct std::allocator<char>'
/usr/lib/gcc/x86_64-redhat-linux/4.1.0/../../../../include/c++/4.1.0/bits/basic_string.h:1284: error: invalid use of undefined type 'struct std::allocator<char>'
/usr/lib/gcc/x86_64-redhat-linux/4.1.0/../../../../include/c++/4.1.0/bits/stringfwd.h:49: error: declaration of 'struct std::allocator<char>'
/usr/lib/gcc/x86_64-redhat-linux/4.1.0/../../../../include/c++/4.1.0/bits/basic_string.h:1302: error: invalid use of undefined type 'struct std::allocator<char>'
/usr/lib/gcc/x86_64-redhat-linux/4.1.0/../../../../include/c++/4.1.0/bits/stringfwd.h:49: error: declaration of 'struct std::allocator<char>'
/usr/lib/gcc/x86_64-redhat-linux/4.1.0/../../../../include/c++/4.1.0/bits/basic_string.h:1323: error: invalid use of undefined type 'struct std::allocator<char>'
/usr/lib/gcc/x86_64-redhat-linux/4.1.0/../../../../include/c++/4.1.0/bits/stringfwd.h:49: error: declaration of 'struct std::allocator<char>'
/usr/lib/gcc/x86_64-redhat-linux/4.1.0/../../../../include/c++/4.1.0/bits/basic_string.h:1344: error: invalid use of undefined type 'struct std::allocator<char>'
/usr/lib/gcc/x86_64-redhat-linux/4.1.0/../../../../include/c++/4.1.0/bits/stringfwd.h:49: error: declaration of 'struct std::allocator<char>'
/usr/lib/gcc/x86_64-redhat-linux/4.1.0/../../../../include/c++/4.1.0/bits/basic_string.h:1368: error: invalid use of undefined type 'struct std::allocator<char>'
/usr/lib/gcc/x86_64-redhat-linux/4.1.0/../../../../include/c++/4.1.0/bits/stringfwd.h:49: error: declaration of 'struct std::allocator<char>'
/usr/lib/gcc/x86_64-redhat-linux/4.1.0/../../../../include/c++/4.1.0/bits/basic_string.h:1380: error: invalid use of undefined type 'struct std::allocator<char>'
/usr/lib/gcc/x86_64-redhat-linux/4.1.0/../../../../include/c++/4.1.0/bits/stringfwd.h:49: error: declaration of 'struct std::allocator<char>'
/usr/lib/gcc/x86_64-redhat-linux/4.1.0/../../../../include/c++/4.1.0/bits/basic_string.h:1391: error: invalid use of undefined type 'struct std::allocator<char>'
/usr/lib/gcc/x86_64-redhat-linux/4.1.0/../../../../include/c++/4.1.0/bits/stringfwd.h:49: error: declaration of 'struct std::allocator<char>'
/usr/lib/gcc/x86_64-redhat-linux/4.1.0/../../../../include/c++/4.1.0/bits/basic_string.h:1401: error: invalid use of undefined type 'struct std::allocator<char>'
/usr/lib/gcc/x86_64-redhat-linux/4.1.0/../../../../include/c++/4.1.0/bits/stringfwd.h:49: error: declaration of 'struct std::allocator<char>'
/usr/lib/gcc/x86_64-redhat-linux/4.1.0/../../../../include/c++/4.1.0/bits/basic_string.h:1412: error: invalid use of undefined type 'struct std::allocator<char>'
/usr/lib/gcc/x86_64-redhat-linux/4.1.0/../../../../include/c++/4.1.0/bits/stringfwd.h:49: error: declaration of 'struct std::allocator<char>'
/usr/lib/gcc/x86_64-redhat-linux/4.1.0/../../../../include/c++/4.1.0/bits/basic_string.h:1425: error: invalid use of undefined type 'struct std::allocator<char>'
/usr/lib/gcc/x86_64-redhat-linux/4.1.0/../../../../include/c++/4.1.0/bits/stringfwd.h:49: error: declaration of 'struct std::allocator<char>'
/usr/lib/gcc/x86_64-redhat-linux/4.1.0/../../../../include/c++/4.1.0/bits/basic_string.tcc:629: error: invalid use of undefined type 'struct std::allocator<char>'
/usr/lib/gcc/x86_64-redhat-linux/4.1.0/../../../../include/c++/4.1.0/bits/stringfwd.h:49: error: declaration of 'struct std::allocator<char>'
/usr/lib/gcc/x86_64-redhat-linux/4.1.0/../../../../include/c++/4.1.0/bits/basic_string.tcc:642: error: invalid use of undefined type 'struct std::allocator<char>'
/usr/lib/gcc/x86_64-redhat-linux/4.1.0/../../../../include/c++/4.1.0/bits/stringfwd.h:49: error: declaration of 'struct std::allocator<char>'
/usr/lib/gcc/x86_64-redhat-linux/4.1.0/../../../../include/c++/4.1.0/bits/basic_string.tcc:655: error: invalid use of undefined type 'struct std::allocator<char>'
/usr/lib/gcc/x86_64-redhat-linux/4.1.0/../../../../include/c++/4.1.0/bits/stringfwd.h:49: error: declaration of 'struct std::allocator<char>'
/usr/lib/gcc/x86_64-redhat-linux/4.1.0/../../../../include/c++/4.1.0/bits/basic_string.tcc:165: error: invalid use of undefined type 'struct std::allocator<char>'
/usr/lib/gcc/x86_64-redhat-linux/4.1.0/../../../../include/c++/4.1.0/bits/stringfwd.h:49: error: declaration of 'struct std::allocator<char>'
/usr/lib/gcc/x86_64-redhat-linux/4.1.0/../../../../include/c++/4.1.0/bits/basic_string.h:1562: error: invalid use of undefined type 'struct std::allocator<char>'
/usr/lib/gcc/x86_64-redhat-linux/4.1.0/../../../../include/c++/4.1.0/bits/stringfwd.h:49: error: declaration of 'struct std::allocator<char>'
/usr/lib/gcc/x86_64-redhat-linux/4.1.0/../../../../include/c++/4.1.0/bits/basic_string.h:1576: error: invalid use of undefined type 'struct std::allocator<char>'
/usr/lib/gcc/x86_64-redhat-linux/4.1.0/../../../../include/c++/4.1.0/bits/stringfwd.h:49: error: declaration of 'struct std::allocator<char>'
/usr/lib/gcc/x86_64-redhat-linux/4.1.0/../../../../include/c++/4.1.0/bits/basic_string.h:1606: error: invalid use of undefined type 'struct std::allocator<char>'
/usr/lib/gcc/x86_64-redhat-linux/4.1.0/../../../../include/c++/4.1.0/bits/stringfwd.h:49: error: declaration of 'struct std::allocator<char>'
/usr/lib/gcc/x86_64-redhat-linux/4.1.0/../../../../include/c++/4.1.0/bits/basic_string.h:1634: error: invalid use of undefined type 'struct std::allocator<char>'
/usr/lib/gcc/x86_64-redhat-linux/4.1.0/../../../../include/c++/4.1.0/bits/stringfwd.h:49: error: declaration of 'struct std::allocator<char>'
/usr/lib/gcc/x86_64-redhat-linux/4.1.0/../../../../include/c++/4.1.0/bits/basic_string.h:1664: error: invalid use of undefined type 'struct std::allocator<char>'
/usr/lib/gcc/x86_64-redhat-linux/4.1.0/../../../../include/c++/4.1.0/bits/stringfwd.h:49: error: declaration of 'struct std::allocator<char>'
/usr/lib/gcc/x86_64-redhat-linux/4.1.0/../../../../include/c++/4.1.0/bits/basic_string.h:1692: error: invalid use of undefined type 'struct std::allocator<char>'
/usr/lib/gcc/x86_64-redhat-linux/4.1.0/../../../../include/c++/4.1.0/bits/stringfwd.h:49: error: declaration of 'struct std::allocator<char>'
/usr/lib/gcc/x86_64-redhat-linux/4.1.0/../../../../include/c++/4.1.0/bits/basic_string.h:1711: error: invalid use of undefined type 'struct std::allocator<char>'
/usr/lib/gcc/x86_64-redhat-linux/4.1.0/../../../../include/c++/4.1.0/bits/stringfwd.h:49: error: declaration of 'struct std::allocator<char>'
/usr/lib/gcc/x86_64-redhat-linux/4.1.0/../../../../include/c++/4.1.0/bits/basic_string.h:1725: error: invalid use of undefined type 'struct std::allocator<char>'
/usr/lib/gcc/x86_64-redhat-linux/4.1.0/../../../../include/c++/4.1.0/bits/stringfwd.h:49: error: declaration of 'struct std::allocator<char>'
/usr/lib/gcc/x86_64-redhat-linux/4.1.0/../../../../include/c++/4.1.0/bits/basic_string.h:1753: error: invalid use of undefined type 'struct std::allocator<char>'
/usr/lib/gcc/x86_64-redhat-linux/4.1.0/../../../../include/c++/4.1.0/bits/stringfwd.h:49: error: declaration of 'struct std::allocator<char>'
/usr/lib/gcc/x86_64-redhat-linux/4.1.0/../../../../include/c++/4.1.0/bits/basic_string.h:1772: error: invalid use of undefined type 'struct std::allocator<char>'
/usr/lib/gcc/x86_64-redhat-linux/4.1.0/../../../../include/c++/4.1.0/bits/stringfwd.h:49: error: declaration of 'struct std::allocator<char>'
/usr/lib/gcc/x86_64-redhat-linux/4.1.0/../../../../include/c++/4.1.0/bits/basic_string.h:1786: error: invalid use of undefined type 'struct std::allocator<char>'
/usr/lib/gcc/x86_64-redhat-linux/4.1.0/../../../../include/c++/4.1.0/bits/stringfwd.h:49: error: declaration of 'struct std::allocator<char>'
/usr/lib/gcc/x86_64-redhat-linux/4.1.0/../../../../include/c++/4.1.0/bits/basic_string.h:1815: error: invalid use of undefined type 'struct std::allocator<char>'
/usr/lib/gcc/x86_64-redhat-linux/4.1.0/../../../../include/c++/4.1.0/bits/stringfwd.h:49: error: declaration of 'struct std::allocator<char>'
/usr/lib/gcc/x86_64-redhat-linux/4.1.0/../../../../include/c++/4.1.0/bits/basic_string.h:1845: error: invalid use of undefined type 'struct std::allocator<char>'
/usr/lib/gcc/x86_64-redhat-linux/4.1.0/../../../../include/c++/4.1.0/bits/stringfwd.h:49: error: declaration of 'struct std::allocator<char>'
/usr/lib/gcc/x86_64-redhat-linux/4.1.0/../../../../include/c++/4.1.0/bits/basic_string.h:1874: error: invalid use of undefined type 'struct std::allocator<char>'
/usr/lib/gcc/x86_64-redhat-linux/4.1.0/../../../../include/c++/4.1.0/bits/stringfwd.h:49: error: declaration of 'struct std::allocator<char>'
/usr/lib/gcc/x86_64-redhat-linux/4.1.0/../../../../include/c++/4.1.0/bits/basic_string.h:1906: error: invalid use of undefined type 'struct std::allocator<char>'
/usr/lib/gcc/x86_64-redhat-linux/4.1.0/../../../../include/c++/4.1.0/bits/stringfwd.h:49: error: declaration of 'struct std::allocator<char>'
/usr/lib/gcc/x86_64-redhat-linux/4.1.0/../../../../include/c++/4.1.0/bits/basic_string.tcc:885: error: invalid use of undefined type 'struct std::allocator<char>'
/usr/lib/gcc/x86_64-redhat-linux/4.1.0/../../../../include/c++/4.1.0/bits/stringfwd.h:49: error: declaration of 'struct std::allocator<char>'
/usr/lib/gcc/x86_64-redhat-linux/4.1.0/../../../../include/c++/4.1.0/bits/basic_string.tcc:901: error: invalid use of undefined type 'struct std::allocator<char>'
/usr/lib/gcc/x86_64-redhat-linux/4.1.0/../../../../include/c++/4.1.0/bits/stringfwd.h:49: error: declaration of 'struct std::allocator<char>'
/usr/lib/gcc/x86_64-redhat-linux/4.1.0/../../../../include/c++/4.1.0/bits/basic_string.tcc:933: error: invalid use of undefined type 'struct std::allocator<char>'
/usr/lib/gcc/x86_64-redhat-linux/4.1.0/../../../../include/c++/4.1.0/bits/stringfwd.h:49: error: declaration of 'struct std::allocator<char>'
/usr/lib/gcc/x86_64-redhat-linux/4.1.0/../../../../include/c++/4.1.0/bits/basic_string.tcc:950: error: invalid use of undefined type 'struct std::allocator<char>'
/usr/lib/gcc/x86_64-redhat-linux/4.1.0/../../../../include/c++/4.1.0/bits/stringfwd.h:49: error: declaration of 'struct std::allocator<char>'
/usr/lib/gcc/x86_64-redhat-linux/4.1.0/../../../../include/c++/4.1.0/bits/ios_base.h:256: error: '__ios_flags' has not been declared
/usr/lib/gcc/x86_64-redhat-linux/4.1.0/../../../../include/c++/4.1.0/bits/ios_base.h:259: error: '__ios_flags' has not been declared
/usr/lib/gcc/x86_64-redhat-linux/4.1.0/../../../../include/c++/4.1.0/bits/ios_base.h:262: error: '__ios_flags' has not been declared
/usr/lib/gcc/x86_64-redhat-linux/4.1.0/../../../../include/c++/4.1.0/bits/ios_base.h:265: error: '__ios_flags' has not been declared
/usr/lib/gcc/x86_64-redhat-linux/4.1.0/../../../../include/c++/4.1.0/bits/ios_base.h:270: error: '__ios_flags' has not been declared
/usr/lib/gcc/x86_64-redhat-linux/4.1.0/../../../../include/c++/4.1.0/bits/ios_base.h:274: error: '__ios_flags' has not been declared
/usr/lib/gcc/x86_64-redhat-linux/4.1.0/../../../../include/c++/4.1.0/bits/ios_base.h:277: error: '__ios_flags' has not been declared
/usr/lib/gcc/x86_64-redhat-linux/4.1.0/../../../../include/c++/4.1.0/bits/ios_base.h:281: error: '__ios_flags' has not been declared
/usr/lib/gcc/x86_64-redhat-linux/4.1.0/../../../../include/c++/4.1.0/bits/ios_base.h:284: error: '__ios_flags' has not been declared
/usr/lib/gcc/x86_64-redhat-linux/4.1.0/../../../../include/c++/4.1.0/bits/ios_base.h:288: error: '__ios_flags' has not been declared
/usr/lib/gcc/x86_64-redhat-linux/4.1.0/../../../../include/c++/4.1.0/bits/ios_base.h:292: error: '__ios_flags' has not been declared
/usr/lib/gcc/x86_64-redhat-linux/4.1.0/../../../../include/c++/4.1.0/bits/ios_base.h:295: error: '__ios_flags' has not been declared
/usr/lib/gcc/x86_64-redhat-linux/4.1.0/../../../../include/c++/4.1.0/bits/ios_base.h:298: error: '__ios_flags' has not been declared
/usr/lib/gcc/x86_64-redhat-linux/4.1.0/../../../../include/c++/4.1.0/bits/ios_base.h:301: error: '__ios_flags' has not been declared
/usr/lib/gcc/x86_64-redhat-linux/4.1.0/../../../../include/c++/4.1.0/bits/ios_base.h:305: error: '__ios_flags' has not been declared
/usr/lib/gcc/x86_64-redhat-linux/4.1.0/../../../../include/c++/4.1.0/bits/ios_base.h:308: error: '__ios_flags' has not been declared
/usr/lib/gcc/x86_64-redhat-linux/4.1.0/../../../../include/c++/4.1.0/bits/ios_base.h:311: error: '__ios_flags' has not been declared
/usr/lib/gcc/x86_64-redhat-linux/4.1.0/../../../../include/c++/4.1.0/bits/ios_base.h:314: error: '__ios_flags' has not been declared
/usr/lib/gcc/x86_64-redhat-linux/4.1.0/../../../../include/c++/4.1.0/bits/ios_base.h:332: error: '__ios_flags' has not been declared
/usr/lib/gcc/x86_64-redhat-linux/4.1.0/../../../../include/c++/4.1.0/bits/ios_base.h:335: error: '__ios_flags' has not been declared
/usr/lib/gcc/x86_64-redhat-linux/4.1.0/../../../../include/c++/4.1.0/bits/ios_base.h:340: error: '__ios_flags' has not been declared
/usr/lib/gcc/x86_64-redhat-linux/4.1.0/../../../../include/c++/4.1.0/bits/ios_base.h:362: error: '__ios_flags' has not been declared
/usr/lib/gcc/x86_64-redhat-linux/4.1.0/../../../../include/c++/4.1.0/bits/ios_base.h:365: error: '__ios_flags' has not been declared
/usr/lib/gcc/x86_64-redhat-linux/4.1.0/../../../../include/c++/4.1.0/bits/ios_base.h:371: error: '__ios_flags' has not been declared
/usr/lib/gcc/x86_64-redhat-linux/4.1.0/../../../../include/c++/4.1.0/bits/ios_base.h:374: error: '__ios_flags' has not been declared
/usr/lib/gcc/x86_64-redhat-linux/4.1.0/../../../../include/c++/4.1.0/bits/ios_base.h:377: error: '__ios_flags' has not been declared
/usr/lib/gcc/x86_64-redhat-linux/4.1.0/../../../../include/c++/4.1.0/bits/ios_base.h:380: error: '__ios_flags' has not been declared
/usr/lib/gcc/x86_64-redhat-linux/4.1.0/../../../../include/c++/4.1.0/bits/ios_base.h:472: error: '_Atomic_word' does not name a type
/usr/lib/gcc/x86_64-redhat-linux/4.1.0/../../../../include/c++/4.1.0/bits/ios_base.h:538: error: '_Atomic_word' does not name a type
/usr/lib/gcc/x86_64-redhat-linux/4.1.0/../../../../include/c++/4.1.0/bits/ios_base.h: In constructor 'std::ios_base::_Callback_list::_Callback_list(void (*)(std::ios_base::event, std::ios_base&, int), int, std::ios_base::_Callback_list*)':
/usr/lib/gcc/x86_64-redhat-linux/4.1.0/../../../../include/c++/4.1.0/bits/ios_base.h:476: error: class 'std::ios_base::_Callback_list' does not have any field named '_M_refcount'
/usr/lib/gcc/x86_64-redhat-linux/4.1.0/../../../../include/c++/4.1.0/bits/ios_base.h: In member function 'void std::ios_base::_Callback_list::_M_add_reference()':
/usr/lib/gcc/x86_64-redhat-linux/4.1.0/../../../../include/c++/4.1.0/bits/ios_base.h:479: error: '_M_refcount' was not declared in this scope
/usr/lib/gcc/x86_64-redhat-linux/4.1.0/../../../../include/c++/4.1.0/bits/ios_base.h: In member function 'int std::ios_base::_Callback_list::_M_remove_reference()':
/usr/lib/gcc/x86_64-redhat-linux/4.1.0/../../../../include/c++/4.1.0/bits/ios_base.h:484: error: '__exchange_and_add' is not a member of '__gnu_cxx'
/usr/lib/gcc/x86_64-redhat-linux/4.1.0/../../../../include/c++/4.1.0/bits/ios_base.h:484: error: '_M_refcount' was not declared in this scope
/usr/lib/gcc/x86_64-redhat-linux/4.1.0/../../../../include/c++/4.1.0/bits/locale_facets.h: At global scope:
/usr/lib/gcc/x86_64-redhat-linux/4.1.0/../../../../include/c++/4.1.0/bits/locale_facets.h:66: error: expected ',' or '...' before '&' token
/usr/lib/gcc/x86_64-redhat-linux/4.1.0/../../../../include/c++/4.1.0/bits/locale_facets.h:72: error: expected ',' or '...' before '&' token
/usr/lib/gcc/x86_64-redhat-linux/4.1.0/../../../../include/c++/4.1.0/bits/locale_facets.h:77: error: expected ',' or '...' before '&' token
/usr/lib/gcc/x86_64-redhat-linux/4.1.0/../../../../include/c++/4.1.0/bits/locale_facets.h:82: error: expected ',' or '...' before '&' token
/usr/lib/gcc/x86_64-redhat-linux/4.1.0/../../../../include/c++/4.1.0/bits/locale_facets.h:145: error: invalid use of undefined type 'struct std::ctype_base'
/usr/lib/gcc/x86_64-redhat-linux/4.1.0/../../../../include/c++/4.1.0/bits/localefwd.h:109: error: forward declaration of 'struct std::ctype_base'
/usr/lib/gcc/x86_64-redhat-linux/4.1.0/../../../../include/c++/4.1.0/bits/locale_facets.h:163: error: 'mask' has not been declared
/usr/lib/gcc/x86_64-redhat-linux/4.1.0/../../../../include/c++/4.1.0/bits/locale_facets.h:180: error: 'mask' has not been declared
/usr/lib/gcc/x86_64-redhat-linux/4.1.0/../../../../include/c++/4.1.0/bits/locale_facets.h:196: error: expected ';' before '(' token
/usr/lib/gcc/x86_64-redhat-linux/4.1.0/../../../../include/c++/4.1.0/bits/locale_facets.h:211: error: expected `;' before 'const'
/usr/lib/gcc/x86_64-redhat-linux/4.1.0/../../../../include/c++/4.1.0/bits/locale_facets.h:212: error: expected ';' before '(' token
/usr/lib/gcc/x86_64-redhat-linux/4.1.0/../../../../include/c++/4.1.0/bits/locale_facets.h:225: error: expected `;' before 'char_type'
/usr/lib/gcc/x86_64-redhat-linux/4.1.0/../../../../include/c++/4.1.0/bits/locale_facets.h:372: error: 'mask' has not been declared
/usr/lib/gcc/x86_64-redhat-linux/4.1.0/../../../../include/c++/4.1.0/bits/locale_facets.h:392: error: 'mask' has not been declared
/usr/lib/gcc/x86_64-redhat-linux/4.1.0/../../../../include/c++/4.1.0/bits/locale_facets.h:410: error: 'do_scan_is' declared as a 'virtual' field
/usr/lib/gcc/x86_64-redhat-linux/4.1.0/../../../../include/c++/4.1.0/bits/locale_facets.h:410: error: expected ';' before '(' token
/usr/lib/gcc/x86_64-redhat-linux/4.1.0/../../../../include/c++/4.1.0/bits/locale_facets.h:429: error: 'do_scan_not' declared as a 'virtual' field
/usr/lib/gcc/x86_64-redhat-linux/4.1.0/../../../../include/c++/4.1.0/bits/locale_facets.h:429: error: expected ';' before '(' token
/usr/lib/gcc/x86_64-redhat-linux/4.1.0/../../../../include/c++/4.1.0/bits/locale_facets.h:675: error: invalid use of undefined type 'struct std::ctype_base'
/usr/lib/gcc/x86_64-redhat-linux/4.1.0/../../../../include/c++/4.1.0/bits/localefwd.h:109: error: forward declaration of 'struct std::ctype_base'
/usr/lib/gcc/x86_64-redhat-linux/4.1.0/../../../../include/c++/4.1.0/bits/locale_facets.h:684: error: '__c_locale' does not name a type
/usr/lib/gcc/x86_64-redhat-linux/4.1.0/../../../../include/c++/4.1.0/bits/locale_facets.h:686: error: '__to_type' does not name a type
/usr/lib/gcc/x86_64-redhat-linux/4.1.0/../../../../include/c++/4.1.0/bits/locale_facets.h:687: error: '__to_type' does not name a type
/usr/lib/gcc/x86_64-redhat-linux/4.1.0/../../../../include/c++/4.1.0/bits/locale_facets.h:688: error: expected ';' before '*' token
/usr/lib/gcc/x86_64-redhat-linux/4.1.0/../../../../include/c++/4.1.0/bits/locale_facets.h:712: error: expected ',' or '...' before '*' token
/usr/lib/gcc/x86_64-redhat-linux/4.1.0/../../../../include/c++/4.1.0/bits/locale_facets.h:725: error: expected `)' before '__cloc'
/usr/lib/gcc/x86_64-redhat-linux/4.1.0/../../../../include/c++/4.1.0/bits/locale_facets.h:738: error: 'mask' has not been declared
/usr/lib/gcc/x86_64-redhat-linux/4.1.0/../../../../include/c++/4.1.0/bits/locale_facets.h:753: error: 'mask' has not been declared
/usr/lib/gcc/x86_64-redhat-linux/4.1.0/../../../../include/c++/4.1.0/bits/locale_facets.h:767: error: 'scan_is' declared as an 'inline' field
/usr/lib/gcc/x86_64-redhat-linux/4.1.0/../../../../include/c++/4.1.0/bits/locale_facets.h:767: error: expected ';' before '(' token
/usr/lib/gcc/x86_64-redhat-linux/4.1.0/../../../../include/c++/4.1.0/bits/locale_facets.h:781: error: 'scan_not' declared as an 'inline' field
/usr/lib/gcc/x86_64-redhat-linux/4.1.0/../../../../include/c++/4.1.0/bits/locale_facets.h:781: error: expected ';' before '(' token
/usr/lib/gcc/x86_64-redhat-linux/4.1.0/../../../../include/c++/4.1.0/bits/locale_facets.h:973: error: expected ';' before '*' token
/usr/lib/gcc/x86_64-redhat-linux/4.1.0/../../../../include/c++/4.1.0/bits/locale_facets.h:978: error: expected `;' before 'static'
/usr/lib/gcc/x86_64-redhat-linux/4.1.0/../../../../include/c++/4.1.0/bits/locale_facets.h:978: error: expected ';' before '*' token
/usr/lib/gcc/x86_64-redhat-linux/4.1.0/../../../../include/c++/4.1.0/bits/locale_facets.h: In instantiation of 'std::ctype<wchar_t>':
/usr/lib/gcc/x86_64-redhat-linux/4.1.0/../../../../include/c++/4.1.0/bits/locale_facets.h:1513:   instantiated from 'std::ctype_byname<wchar_t>'
/usr/lib/gcc/x86_64-redhat-linux/4.1.0/../../../../include/c++/4.1.0/bits/locale_facets.h:1530:   instantiated from here
/usr/lib/gcc/x86_64-redhat-linux/4.1.0/../../../../include/c++/4.1.0/bits/locale_facets.h:611: error: no type named 'mask' in 'class std::__ctype_abstract_base<wchar_t>'
/usr/lib/gcc/x86_64-redhat-linux/4.1.0/../../../../include/c++/4.1.0/bits/locale_facets.h:624: error: no type named 'mask' in 'class std::__ctype_abstract_base<wchar_t>'
/usr/lib/gcc/x86_64-redhat-linux/4.1.0/../../../../include/c++/4.1.0/bits/locale_facets.h:627: error: no type named 'mask' in 'class std::__ctype_abstract_base<wchar_t>'
/usr/lib/gcc/x86_64-redhat-linux/4.1.0/../../../../include/c++/4.1.0/bits/locale_facets.h:630: error: no type named 'mask' in 'class std::__ctype_abstract_base<wchar_t>'
/usr/lib/gcc/x86_64-redhat-linux/4.1.0/../../../../include/c++/4.1.0/bits/locale_facets.h:634: error: no type named 'mask' in 'class std::__ctype_abstract_base<wchar_t>'
/usr/lib/gcc/x86_64-redhat-linux/4.1.0/../../../../include/c++/4.1.0/bits/codecvt.h:282: error: '__c_locale' does not name a type
/usr/lib/gcc/x86_64-redhat-linux/4.1.0/../../../../include/c++/4.1.0/bits/codecvt.h:292: error: expected `)' before '__cloc'
/usr/lib/gcc/x86_64-redhat-linux/4.1.0/../../../../include/c++/4.1.0/bits/codecvt.h:343: error: '__c_locale' does not name a type
/usr/lib/gcc/x86_64-redhat-linux/4.1.0/../../../../include/c++/4.1.0/bits/codecvt.h:352: error: expected `)' before '__cloc'
/usr/lib/gcc/x86_64-redhat-linux/4.1.0/../../../../include/c++/4.1.0/bits/locale_facets.h:1708: error: expected `)' before '__cloc'
/usr/lib/gcc/x86_64-redhat-linux/4.1.0/../../../../include/c++/4.1.0/bits/locale_facets.h:1865: error: '__c_locale' has not been declared
/usr/lib/gcc/x86_64-redhat-linux/4.1.0/../../../../include/c++/4.1.0/bits/locale_facets.h:1876: error: variable or field '_M_initialize_numpunct' declared void
/usr/lib/gcc/x86_64-redhat-linux/4.1.0/../../../../include/c++/4.1.0/bits/locale_facets.h:1876: error: 'int std::numpunct<char>::_M_initialize_numpunct' is not a static member of 'class std::numpunct<char>'
/usr/lib/gcc/x86_64-redhat-linux/4.1.0/../../../../include/c++/4.1.0/bits/locale_facets.h:1876: error: '__c_locale' was not declared in this scope
/usr/lib/gcc/x86_64-redhat-linux/4.1.0/../../../../include/c++/4.1.0/bits/locale_facets.h: In constructor 'std::numpunct_byname<_CharT>::numpunct_byname(const char*, size_t)':
/usr/lib/gcc/x86_64-redhat-linux/4.1.0/../../../../include/c++/4.1.0/bits/locale_facets.h:1901: error: '__c_locale' was not declared in this scope
/usr/lib/gcc/x86_64-redhat-linux/4.1.0/../../../../include/c++/4.1.0/bits/locale_facets.h:1901: error: expected `;' before '__tmp'
/usr/lib/gcc/x86_64-redhat-linux/4.1.0/../../../../include/c++/4.1.0/bits/locale_facets.h:1902: error: '__tmp' was not declared in this scope
/usr/lib/gcc/x86_64-redhat-linux/4.1.0/../../../../include/c++/4.1.0/bits/locale_facets.h: At global scope:
/usr/lib/gcc/x86_64-redhat-linux/4.1.0/../../../../include/c++/4.1.0/bits/locale_facets.h:1926: error: expected constructor, destructor, or type conversion before 'template'
/usr/lib/gcc/x86_64-redhat-linux/4.1.0/../../../../include/c++/4.1.0/typeinfo:40: error: expected `}' before end of line
/usr/lib/gcc/x86_64-redhat-linux/4.1.0/../../../../include/c++/4.1.0/typeinfo:40: error: expected declaration before end of line
make[2]: *** [Font.lo] Error 1
make[1]: *** [all-recursive] Error 1
make[1]: Leaving directory `/home/justin/rpmbuild/BUILD/silgraphite-svn'
make: *** [all] Error 2
error: Bad exit status from /var/tmp/rpm-tmp.64427 (%build)


RPM build errors:
    Bad exit status from /var/tmp/rpm-tmp.64427 (%build)

[Date Prev][Date Next]   [Thread Prev][Thread Next]   [Thread Index] [Date Index] [Author Index]