[Date Prev][Date Next]   [Thread Prev][Thread Next]   [Thread Index] [Date Index] [Author Index]

mkinitrd src.rpm



The last few have failed immediately.  The latest one...

[gjohnson localhost ~]$ rpmbuild --rebuild mkinitrd-6.0.28-2.fc9.src.rpm 
Installing mkinitrd-6.0.28-2.fc9.src.rpm
warning: user mockbuild does not exist - using root
warning: group mockbuild does not exist - using root
warning: user mockbuild does not exist - using root
warning: group mockbuild does not exist - using root
Executing(%prep): /bin/sh -e /var/tmp/rpm-tmp.46731
+ umask 022
+ cd /home/gjohnson/rpmbuild/BUILD
+ LANG=C
+ export LANG
+ unset DISPLAY
+ cd /home/gjohnson/rpmbuild/BUILD
+ rm -rf mkinitrd-6.0.28
+ /usr/bin/bzip2 -dc /home/gjohnson/rpmbuild/SOURCES/mkinitrd-6.0.28.tar.bz2
+ tar -xf -
+ STATUS=0
+ '[' 0 -ne 0 ']'
+ cd mkinitrd-6.0.28
++ /usr/bin/id -u
+ '[' 500 = 0 ']'
++ /usr/bin/id -u
+ '[' 500 = 0 ']'
+ /bin/chmod -Rf a+rX,u+w,g-w,o-w .
+ exit 0
Executing(%build): /bin/sh -e /var/tmp/rpm-tmp.9586
+ umask 022
+ cd /home/gjohnson/rpmbuild/BUILD
+ cd mkinitrd-6.0.28
+ LANG=C
+ export LANG
+ unset DISPLAY
+ make LIB=lib
making /usr/home/gjohnson/rpmbuild/BUILD/mkinitrd-6.0.28/version.h
make[1]: Entering directory
`/usr/home/gjohnson/rpmbuild/BUILD/mkinitrd-6.0.28/nash'
making /usr/home/gjohnson/rpmbuild/BUILD/mkinitrd-6.0.28/nash/version.h
gcc -Wall -Werror -g -D_FORTIFY_SOURCE=2 -Wno-unused-function -fPIC
-std=gnu99 -D_GNU_SOURCE=1
-I/usr/home/gjohnson/rpmbuild/BUILD/mkinitrd-6.0.28/nash/include
-I/usr/home/gjohnson/rpmbuild/BUILD/mkinitrd-6.0.28/bdevid/include
-I/usr/include/libdhcp -I/usr/include/dhcp4client -I/usr/include/dhcp6client
-I/usr/include/glib-2.0 -I/usr/lib/glib-2.0/include     -c -o lib.o lib.c
cc1: warnings being treated as errors
procdev.h:67: error: inline function 'getDevsFromProc' declared but never
defined
make[1]: *** [lib.o] Error 1
make[1]: Leaving directory
`/usr/home/gjohnson/rpmbuild/BUILD/mkinitrd-6.0.28/nash'
make: *** [subdirs] Error 1
error: Bad exit status from /var/tmp/rpm-tmp.9586 (%build)


RPM build errors:
    user mockbuild does not exist - using root
    group mockbuild does not exist - using root
    user mockbuild does not exist - using root
    group mockbuild does not exist - using root
    Bad exit status from /var/tmp/rpm-tmp.9586 (%build)
[gjohnson localhost ~]$ 

-- 
View this message in context: http://www.nabble.com/mkinitrd-src.rpm-tp14935229p14935229.html
Sent from the Fedora Test List mailing list archive at Nabble.com.


[Date Prev][Date Next]   [Thread Prev][Thread Next]   [Thread Index] [Date Index] [Author Index]