[Date Prev][Date Next]   [Thread Prev][Thread Next]   [Thread Index] [Date Index] [Author Index]

[Libguestfs] builder-debian libguestfs FAILED build step 1f0c650c8ffdf0602ec74b999f62d3efa6822c96



This is an automatic message generated by the builder on
builder-debian for libguestfs.  Log files from the build
follow below.

Linux builder-debian.home.annexia.org 2.6.36-trunk-amd64 #1 SMP Wed Oct 27 14:28:29 UTC 2010 x86_64 GNU/Linux
Fri Jul 15 21:00:01 BST 2011

-----

+ git pull --rebase git://git.annexia.org/git/libguestfs.git master
>From git://git.annexia.org/git/libguestfs
 * branch            master     -> FETCH_HEAD
First, rewinding head to replay your work on top of it...
Fast-forwarded master to 1f0c650c8ffdf0602ec74b999f62d3efa6822c96.
+ git clean -d -f
++ awk '{print $2}'
++ head -1
++ git log
+ gitsha=1f0c650c8ffdf0602ec74b999f62d3efa6822c96
+ ./bootstrap
./bootstrap: getting gnulib files...
autopoint: *** Missing version: please specify in configure.ac through a line 'AM_GNU_GETTEXT_VERSION(x.yy.zz)' the gettext version the package is using
autopoint: *** Stop.
Module list with included dependencies (indented):
    accept
    alignof
    alignof-tests
    alloca
    alloca-opt
    alloca-opt-tests
    arg-nonnull
    arpa_inet
    arpa_inet-tests
    binary-io
    binary-io-tests
    bind
    bitrotate
    bitrotate-tests
    btowc
    btowc-tests
  byteswap
    byteswap-tests
    c++defs
  c-ctype
    c-ctype-tests
    chdir-long
    chown
    chown-tests
    clock-time
    cloexec
    cloexec-tests
    close
    configmake
  connect
    d-type
    dirent
    dirent-tests
    dirfd
    dirname-lgpl
    dosname
    double-slash-root
    dup2
    dup2-tests
    environ
    environ-tests
    errno
    errno-tests
  error
    exitfail
    extensions
    fchdir
    fchdir-tests
    fclose
    fclose-tests
    fcntl
    fcntl-h
    fcntl-h-tests
    fcntl-tests
    fd-hook
    fd-safer-flag
    fdopendir
    fdopendir-tests
    fflush
    fflush-tests
    filenamecat-lgpl
    float
    fnmatch
    fnmatch-tests
    fpurge
    fpurge-tests
    freading
    freading-tests
    fseeko
    fseeko-tests
  fsusage
    ftell
    ftell-tests
    ftello
    ftello-tests
    full-read
  futimens
    futimens-tests
  getaddrinfo
    getaddrinfo-tests
    getcwd-lgpl
    getcwd-lgpl-tests
    getdelim
    getdelim-tests
    getdtablesize
    getdtablesize-tests
    getgroups
    getgroups-tests
  getline
    getline-tests
    getlogin_r
    getlogin_r-tests
    getpagesize
    gettext-h
    gettime
    gettimeofday
    gettimeofday-tests
    getugroups
  glob
    glob-tests
  hash
    hash-pjw
    hash-tests
    havelib
    hostent
  ignore-value
    ignore-value-tests
    include_next
    inet_ntop
    inet_ntop-tests
    inet_pton
    inet_pton-tests
    intprops
    intprops-tests
    inttostr
    inttostr-tests
    inttypes
    inttypes-incomplete
    inttypes-tests
    ioctl
    lchown
    lchown-tests
    listen
    localcharset
    locale
    locale-tests
    localename
    localename-tests
    lock
    lock-tests
    lseek
    lseek-tests
    lstat
    lstat-tests
    malloc-posix
    malloca
    malloca-tests
  manywarnings
    mbrtowc
    mbrtowc-tests
    mbsinit
    mbsinit-tests
    mbsrtowcs
    mbsrtowcs-tests
    mbtowc
    memchr
    memchr-tests
    mempcpy
    memrchr
    memrchr-tests
    mgetgroups
    mkdir
    mkdir-tests
  mkdtemp
    multiarch
  netdb
    netdb-tests
    netinet_in
    netinet_in-tests
    open
    open-tests
  openat
    openat-die
    openat-tests
    pathmax
  perror
    perror-tests
    pipe-posix
    pipe-posix-tests
  pread
    pread-tests
    priv-set
    priv-set-tests
    progname
    putenv
    rawmemchr
    rawmemchr-tests
    read
  read-file
    read-file-tests
  readlink
    readlink-tests
    realloc-gnu
    realloc-gnu-tests
    realloc-posix
    rmdir
    rmdir-tests
    safe-read
    same-inode
    save-cwd
  select
    select-tests
    servent
    setenv
    setenv-tests
    setlocale
    setlocale-tests
    setsockopt
    size_max
  sleep
    sleep-tests
    snprintf
    snprintf-tests
  socket
    socketlib
    sockets
    sockets-tests
    socklen
    ssize_t
    stat
    stat-tests
    stat-time
    stat-time-tests
    stdbool
    stdbool-tests
    stddef
    stddef-tests
    stdint
    stdint-tests
    stdio
    stdio-tests
    stdlib
    stdlib-tests
  strchrnul
    strchrnul-tests
    strdup-posix
    streq
    strerror
    strerror-override
    strerror-tests
    strerror_r-posix
    strerror_r-posix-tests
    string
    string-tests
  strndup
    strnlen
    strnlen-tests
    strnlen1
    symlink
    symlink-tests
  symlinkat
    symlinkat-tests
    sys_ioctl
    sys_ioctl-tests
  sys_select
    sys_select-tests
    sys_socket
    sys_socket-tests
    sys_stat
    sys_stat-tests
    sys_time
    sys_time-tests
    sys_uio
    sys_uio-tests
  sys_wait
    sys_wait-tests
    tempname
    thread
    threadlib
    time
    time-tests
    timespec
    unistd
    unistd-safer
    unistd-safer-tests
    unistd-tests
    unlink
    unlink-tests
    unlinkdir
    unsetenv
    unsetenv-tests
    usleep
    usleep-tests
    utimecmp
    utimens
    utimens-tests
    vasnprintf
    vasnprintf-tests
  vasprintf
    vasprintf-tests
    verify
    verify-tests
    warn-on-use
  warnings
    wchar
    wchar-tests
    wcrtomb
    wcrtomb-tests
    wctob
    wctomb
    wctype-h
    wctype-h-tests
    xalloc-oversized
    xsize
    yield
Notice from module error:
  If you are using GNU gettext version 0.16.1 or older, add the following options
  to XGETTEXT_OPTIONS in your po/Makevars:
    --flag=error:3:c-format --flag=error_at_line:5:c-format
Notice from module localcharset:
  If your package's tests make use of the locale_charset() function directly or
  indirectly, you may need to define the CHARSETALIASDIR environment variable,
  so that "make check" works before "make install". In Makefile.am syntax:
  TESTS_ENVIRONMENT += @LOCALCHARSET_TESTS_ENVIRONMENT@
Notice from module vasprintf:
  If you are using GNU gettext version 0.16.1 or older, add the following options
  to XGETTEXT_OPTIONS in your po/Makevars:
    --flag=asprintf:2:c-format --flag=vasprintf:2:c-format
File list:
  build-aux/arg-nonnull.h
  build-aux/c++defs.h
  build-aux/config.rpath
  build-aux/warn-on-use.h
  lib/alignof.h
  lib/alloca.c
  lib/alloca.in.h
  lib/arpa_inet.in.h
  lib/asnprintf.c
  lib/asprintf.c
  lib/at-func.c
  lib/basename-lgpl.c
  lib/bitrotate.h
  lib/byteswap.in.h
  lib/c-ctype.c
  lib/c-ctype.h
  lib/chdir-long.c
  lib/chdir-long.h
  lib/chown.c
  lib/cloexec.c
  lib/cloexec.h
  lib/close.c
  lib/config.charset
  lib/connect.c
  lib/dirent.in.h
  lib/dirfd.c
  lib/dirname-lgpl.c
  lib/dirname.h
  lib/dosname.h
  lib/dup-safer.c
  lib/dup2.c
  lib/errno.in.h
  lib/error.c
  lib/error.h
  lib/exitfail.c
  lib/exitfail.h
  lib/fchdir.c
  lib/fchmodat.c
  lib/fchown-stub.c
  lib/fchownat.c
  lib/fclose.c
  lib/fcntl.c
  lib/fcntl.in.h
  lib/fd-hook.c
  lib/fd-hook.h
  lib/fd-safer.c
  lib/fdopendir.c
  lib/fflush.c
  lib/filenamecat-lgpl.c
  lib/filenamecat.h
  lib/float+.h
  lib/float.in.h
  lib/fnmatch.c
  lib/fnmatch.in.h
  lib/fnmatch_loop.c
  lib/fpurge.c
  lib/freading.c
  lib/freading.h
  lib/fseeko.c
  lib/fstatat.c
  lib/fsusage.c
  lib/fsusage.h
  lib/ftello.c
  lib/full-read.c
  lib/full-read.h
  lib/full-write.c
  lib/futimens.c
  lib/gai_strerror.c
  lib/getaddrinfo.c
  lib/getcwd-lgpl.c
  lib/getdelim.c
  lib/getdtablesize.c
  lib/getline.c
  lib/getlogin_r.c
  lib/gettext.h
  lib/gettime.c
  lib/gettimeofday.c
  lib/glob-libc.h
  lib/glob.c
  lib/glob.in.h
  lib/glthread/lock.c
  lib/glthread/lock.h
  lib/glthread/threadlib.c
  lib/hash.c
  lib/hash.h
  lib/ignore-value.h
  lib/inet_ntop.c
  lib/intprops.h
  lib/lchown.c
  lib/localcharset.c
  lib/localcharset.h
  lib/lseek.c
  lib/lstat.c
  lib/malloc.c
  lib/mbrtowc.c
  lib/mbsinit.c
  lib/mbsrtowcs-impl.h
  lib/mbsrtowcs-state.c
  lib/mbsrtowcs.c
  lib/memchr.c
  lib/memchr.valgrind
  lib/mempcpy.c
  lib/memrchr.c
  lib/mkdir.c
  lib/mkdirat.c
  lib/mkdtemp.c
  lib/netdb.in.h
  lib/netinet_in.in.h
  lib/open.c
  lib/openat-die.c
  lib/openat-priv.h
  lib/openat-proc.c
  lib/openat.c
  lib/openat.h
  lib/perror.c
  lib/pipe-safer.c
  lib/pread.c
  lib/printf-args.c
  lib/printf-args.h
  lib/printf-parse.c
  lib/printf-parse.h
  lib/rawmemchr.c
  lib/rawmemchr.valgrind
  lib/read-file.c
  lib/read-file.h
  lib/read.c
  lib/readlink.c
  lib/realloc.c
  lib/ref-add.sin
  lib/ref-del.sin
  lib/rmdir.c
  lib/safe-read.c
  lib/safe-read.h
  lib/save-cwd.c
  lib/save-cwd.h
  lib/select.c
  lib/size_max.h
  lib/sleep.c
  lib/snprintf.c
  lib/socket.c
  lib/sockets.c
  lib/sockets.h
  lib/stat-time.h
  lib/stat.c
  lib/stdbool.in.h
  lib/stddef.in.h
  lib/stdint.in.h
  lib/stdio-impl.h
  lib/stdio.in.h
  lib/stdlib.in.h
  lib/strchrnul.c
  lib/strchrnul.valgrind
  lib/strdup.c
  lib/streq.h
  lib/strerror-override.c
  lib/strerror-override.h
  lib/strerror.c
  lib/strerror_r.c
  lib/string.in.h
  lib/stripslash.c
  lib/strndup.c
  lib/strnlen.c
  lib/strnlen1.c
  lib/strnlen1.h
  lib/symlink.c
  lib/symlinkat.c
  lib/sys_select.in.h
  lib/sys_socket.in.h
  lib/sys_stat.in.h
  lib/sys_time.in.h
  lib/sys_uio.in.h
  lib/sys_wait.in.h
  lib/tempname.c
  lib/tempname.h
  lib/time.in.h
  lib/timespec.h
  lib/unistd--.h
  lib/unistd-safer.h
  lib/unistd.in.h
  lib/unlink.c
  lib/unlinkat.c
  lib/utimens.c
  lib/utimens.h
  lib/vasnprintf.c
  lib/vasnprintf.h
  lib/vasprintf.c
  lib/verify.h
  lib/w32sock.h
  lib/wchar.in.h
  lib/wctype.in.h
  lib/xalloc-oversized.h
  lib/xsize.h
  m4/00gnulib.m4
  m4/alloca.m4
  m4/arpa_inet_h.m4
  m4/btowc.m4
  m4/byteswap.m4
  m4/chdir-long.m4
  m4/chown.m4
  m4/clock_time.m4
  m4/cloexec.m4
  m4/close.m4
  m4/codeset.m4
  m4/configmake.m4
  m4/d-type.m4
  m4/dirent_h.m4
  m4/dirfd.m4
  m4/dirname.m4
  m4/double-slash-root.m4
  m4/dup2.m4
  m4/eealloc.m4
  m4/environ.m4
  m4/errno_h.m4
  m4/error.m4
  m4/extensions.m4
  m4/fchdir.m4
  m4/fclose.m4
  m4/fcntl-o.m4
  m4/fcntl.m4
  m4/fcntl_h.m4
  m4/fdopendir.m4
  m4/fflush.m4
  m4/filenamecat.m4
  m4/float_h.m4
  m4/fnmatch.m4
  m4/fpurge.m4
  m4/freading.m4
  m4/fseeko.m4
  m4/fsusage.m4
  m4/ftell.m4
  m4/ftello.m4
  m4/futimens.m4
  m4/getaddrinfo.m4
  m4/getcwd.m4
  m4/getdelim.m4
  m4/getdtablesize.m4
  m4/getgroups.m4
  m4/getline.m4
  m4/getlogin_r.m4
  m4/getpagesize.m4
  m4/gettime.m4
  m4/gettimeofday.m4
  m4/getugroups.m4
  m4/glibc21.m4
  m4/glob.m4
  m4/gnulib-common.m4
  m4/hash.m4
  m4/hostent.m4
  m4/include_next.m4
  m4/inet_ntop.m4
  m4/inet_pton.m4
  m4/intlmacosx.m4
  m4/intmax_t.m4
  m4/inttostr.m4
  m4/inttypes-pri.m4
  m4/inttypes.m4
  m4/inttypes_h.m4
  m4/ioctl.m4
  m4/lchown.m4
  m4/lcmessage.m4
  m4/lib-ld.m4
  m4/lib-link.m4
  m4/lib-prefix.m4
  m4/localcharset.m4
  m4/locale-fr.m4
  m4/locale-ja.m4
  m4/locale-zh.m4
  m4/locale_h.m4
  m4/localename.m4
  m4/lock.m4
  m4/longlong.m4
  m4/lseek.m4
  m4/lstat.m4
  m4/malloc.m4
  m4/malloca.m4
  m4/manywarnings.m4
  m4/mbrtowc.m4
  m4/mbsinit.m4
  m4/mbsrtowcs.m4
  m4/mbstate_t.m4
  m4/mbtowc.m4
  m4/memchr.m4
  m4/mempcpy.m4
  m4/memrchr.m4
  m4/mgetgroups.m4
  m4/mkdir.m4
  m4/mkdtemp.m4
  m4/mmap-anon.m4
  m4/mode_t.m4
  m4/multiarch.m4
  m4/netdb_h.m4
  m4/netinet_in_h.m4
  m4/onceonly.m4
  m4/open.m4
  m4/openat.m4
  m4/pathmax.m4
  m4/perror.m4
  m4/pipe.m4
  m4/pread.m4
  m4/printf.m4
  m4/priv-set.m4
  m4/putenv.m4
  m4/rawmemchr.m4
  m4/read-file.m4
  m4/read.m4
  m4/readlink.m4
  m4/realloc.m4
  m4/rmdir.m4
  m4/safe-read.m4
  m4/save-cwd.m4
  m4/select.m4
  m4/servent.m4
  m4/setenv.m4
  m4/setlocale.m4
  m4/size_max.m4
  m4/sleep.m4
  m4/snprintf.m4
  m4/socketlib.m4
  m4/sockets.m4
  m4/socklen.m4
  m4/sockpfaf.m4
  m4/ssize_t.m4
  m4/stat-time.m4
  m4/stat.m4
  m4/stdbool.m4
  m4/stddef_h.m4
  m4/stdint.m4
  m4/stdint_h.m4
  m4/stdio_h.m4
  m4/stdlib_h.m4
  m4/strchrnul.m4
  m4/strdup.m4
  m4/strerror.m4
  m4/strerror_r.m4
  m4/string_h.m4
  m4/strndup.m4
  m4/strnlen.m4
  m4/symlink.m4
  m4/symlinkat.m4
  m4/sys_ioctl_h.m4
  m4/sys_select_h.m4
  m4/sys_socket_h.m4
  m4/sys_stat_h.m4
  m4/sys_time_h.m4
  m4/sys_uio_h.m4
  m4/sys_wait_h.m4
  m4/tempname.m4
  m4/thread.m4
  m4/threadlib.m4
  m4/time_h.m4
  m4/timespec.m4
  m4/ungetc.m4
  m4/unistd-safer.m4
  m4/unistd_h.m4
  m4/unlink.m4
  m4/unlinkdir.m4
  m4/usleep.m4
  m4/utimbuf.m4
  m4/utimecmp.m4
  m4/utimens.m4
  m4/utimes.m4
  m4/vasnprintf.m4
  m4/vasprintf.m4
  m4/warn-on-use.m4
  m4/warnings.m4
  m4/wchar_h.m4
  m4/wchar_t.m4
  m4/wcrtomb.m4
  m4/wctob.m4
  m4/wctomb.m4
  m4/wctype_h.m4
  m4/wint_t.m4
  m4/xsize.m4
  m4/yield.m4
  tests/init.sh
  tests/macros.h
  tests/nap.h
  tests/signature.h
  tests/test-alignof.c
  tests/test-alloca-opt.c
  tests/test-arpa_inet.c
  tests/test-binary-io.c
  tests/test-binary-io.sh
  tests/test-bitrotate.c
  tests/test-btowc.c
  tests/test-btowc1.sh
  tests/test-btowc2.sh
  tests/test-byteswap.c
  tests/test-c-ctype.c
  tests/test-chown.c
  tests/test-chown.h
  tests/test-cloexec.c
  tests/test-dirent.c
  tests/test-dup-safer.c
  tests/test-dup2.c
  tests/test-environ.c
  tests/test-errno.c
  tests/test-fchdir.c
  tests/test-fchownat.c
  tests/test-fclose.c
  tests/test-fcntl-h.c
  tests/test-fcntl.c
  tests/test-fdopendir.c
  tests/test-fflush.c
  tests/test-fflush2.c
  tests/test-fflush2.sh
  tests/test-fnmatch.c
  tests/test-fpurge.c
  tests/test-freading.c
  tests/test-fseeko.c
  tests/test-fseeko.sh
  tests/test-fseeko2.sh
  tests/test-fstatat.c
  tests/test-ftell.c
  tests/test-ftell.sh
  tests/test-ftell2.sh
  tests/test-ftell3.c
  tests/test-ftello.c
  tests/test-ftello.sh
  tests/test-ftello2.sh
  tests/test-ftello3.c
  tests/test-futimens.c
  tests/test-futimens.h
  tests/test-getaddrinfo.c
  tests/test-getcwd-lgpl.c
  tests/test-getdelim.c
  tests/test-getdtablesize.c
  tests/test-getgroups.c
  tests/test-getline.c
  tests/test-getlogin_r.c
  tests/test-gettimeofday.c
  tests/test-glob.c
  tests/test-hash.c
  tests/test-ignore-value.c
  tests/test-inet_ntop.c
  tests/test-inet_pton.c
  tests/test-intprops.c
  tests/test-inttostr.c
  tests/test-inttypes.c
  tests/test-lchown.c
  tests/test-lchown.h
  tests/test-locale.c
  tests/test-localename.c
  tests/test-lock.c
  tests/test-lseek.c
  tests/test-lseek.sh
  tests/test-lstat.c
  tests/test-lstat.h
  tests/test-lutimens.h
  tests/test-malloca.c
  tests/test-mbrtowc-w32-1.sh
  tests/test-mbrtowc-w32-2.sh
  tests/test-mbrtowc-w32-3.sh
  tests/test-mbrtowc-w32-4.sh
  tests/test-mbrtowc-w32-5.sh
  tests/test-mbrtowc-w32.c
  tests/test-mbrtowc.c
  tests/test-mbrtowc1.sh
  tests/test-mbrtowc2.sh
  tests/test-mbrtowc3.sh
  tests/test-mbrtowc4.sh
  tests/test-mbsinit.c
  tests/test-mbsinit.sh
  tests/test-mbsrtowcs.c
  tests/test-mbsrtowcs1.sh
  tests/test-mbsrtowcs2.sh
  tests/test-mbsrtowcs3.sh
  tests/test-mbsrtowcs4.sh
  tests/test-memchr.c
  tests/test-memrchr.c
  tests/test-mkdir.c
  tests/test-mkdir.h
  tests/test-mkdirat.c
  tests/test-netdb.c
  tests/test-netinet_in.c
  tests/test-open.c
  tests/test-open.h
  tests/test-openat.c
  tests/test-perror.c
  tests/test-perror.sh
  tests/test-perror2.c
  tests/test-pipe.c
  tests/test-pread.c
  tests/test-pread.sh
  tests/test-priv-set.c
  tests/test-rawmemchr.c
  tests/test-read-file.c
  tests/test-readlink.c
  tests/test-readlink.h
  tests/test-realloc-gnu.c
  tests/test-rmdir.c
  tests/test-rmdir.h
  tests/test-select-fd.c
  tests/test-select-in.sh
  tests/test-select-out.sh
  tests/test-select-stdin.c
  tests/test-select.c
  tests/test-setenv.c
  tests/test-setlocale1.c
  tests/test-setlocale1.sh
  tests/test-setlocale2.c
  tests/test-setlocale2.sh
  tests/test-sleep.c
  tests/test-snprintf.c
  tests/test-sockets.c
  tests/test-stat-time.c
  tests/test-stat.c
  tests/test-stat.h
  tests/test-stdbool.c
  tests/test-stddef.c
  tests/test-stdint.c
  tests/test-stdio.c
  tests/test-stdlib.c
  tests/test-strchrnul.c
  tests/test-strerror.c
  tests/test-strerror_r.c
  tests/test-string.c
  tests/test-strnlen.c
  tests/test-symlink.c
  tests/test-symlink.h
  tests/test-symlinkat.c
  tests/test-sys_ioctl.c
  tests/test-sys_select.c
  tests/test-sys_socket.c
  tests/test-sys_stat.c
  tests/test-sys_time.c
  tests/test-sys_uio.c
  tests/test-sys_wait.c
  tests/test-sys_wait.h
  tests/test-time.c
  tests/test-unistd.c
  tests/test-unlink.c
  tests/test-unlink.h
  tests/test-unlinkat.c
  tests/test-unsetenv.c
  tests/test-usleep.c
  tests/test-utimens-common.h
  tests/test-utimens.c
  tests/test-utimens.h
  tests/test-vasnprintf.c
  tests/test-vasprintf.c
  tests/test-verify.c
  tests/test-verify.sh
  tests/test-wchar.c
  tests/test-wcrtomb-w32-1.sh
  tests/test-wcrtomb-w32-2.sh
  tests/test-wcrtomb-w32-3.sh
  tests/test-wcrtomb-w32-4.sh
  tests/test-wcrtomb-w32-5.sh
  tests/test-wcrtomb-w32.c
  tests/test-wcrtomb.c
  tests/test-wcrtomb.sh
  tests/test-wctype-h.c
  tests/zerosize-ptr.h
  lib/accept.c -> tests/accept.c
  lib/anytostr.c -> tests/anytostr.c
  lib/binary-io.h -> tests/binary-io.h
  lib/bind.c -> tests/bind.c
  lib/btowc.c -> tests/btowc.c
  lib/dup-safer-flag.c -> tests/dup-safer-flag.c
  lib/fd-safer-flag.c -> tests/fd-safer-flag.c
  lib/ftell.c -> tests/ftell.c
  lib/getgroups.c -> tests/getgroups.c
  lib/getpagesize.c -> tests/getpagesize.c
  lib/getugroups.c -> tests/getugroups.c
  lib/getugroups.h -> tests/getugroups.h
  lib/glthread/thread.c -> tests/glthread/thread.c
  lib/glthread/thread.h -> tests/glthread/thread.h
  lib/glthread/yield.h -> tests/glthread/yield.h
  lib/hash-pjw.c -> tests/hash-pjw.c
  lib/hash-pjw.h -> tests/hash-pjw.h
  lib/imaxtostr.c -> tests/imaxtostr.c
  lib/inet_pton.c -> tests/inet_pton.c
  lib/inttostr.c -> tests/inttostr.c
  lib/inttostr.h -> tests/inttostr.h
  lib/inttypes.in.h -> tests/inttypes.in.h
  lib/ioctl.c -> tests/ioctl.c
  lib/listen.c -> tests/listen.c
  lib/locale.in.h -> tests/locale.in.h
  lib/localename.c -> tests/localename.c
  lib/localename.h -> tests/localename.h
  lib/malloca.c -> tests/malloca.c
  lib/malloca.h -> tests/malloca.h
  lib/malloca.valgrind -> tests/malloca.valgrind
  lib/mbtowc-impl.h -> tests/mbtowc-impl.h
  lib/mbtowc.c -> tests/mbtowc.c
  lib/mgetgroups.c -> tests/mgetgroups.c
  lib/mgetgroups.h -> tests/mgetgroups.h
  lib/offtostr.c -> tests/offtostr.c
  lib/pathmax.h -> tests/pathmax.h
  lib/pipe.c -> tests/pipe.c
  lib/priv-set.c -> tests/priv-set.c
  lib/priv-set.h -> tests/priv-set.h
  lib/progname.c -> tests/progname.c
  lib/progname.h -> tests/progname.h
  lib/putenv.c -> tests/putenv.c
  lib/realloc.c -> tests/realloc.c
  lib/same-inode.h -> tests/same-inode.h
  lib/setenv.c -> tests/setenv.c
  lib/setlocale.c -> tests/setlocale.c
  lib/setsockopt.c -> tests/setsockopt.c
  lib/sys_ioctl.in.h -> tests/sys_ioctl.in.h
  lib/uinttostr.c -> tests/uinttostr.c
  lib/umaxtostr.c -> tests/umaxtostr.c
  lib/unlinkdir.c -> tests/unlinkdir.c
  lib/unlinkdir.h -> tests/unlinkdir.h
  lib/unsetenv.c -> tests/unsetenv.c
  lib/usleep.c -> tests/usleep.c
  lib/utimecmp.c -> tests/utimecmp.c
  lib/utimecmp.h -> tests/utimecmp.h
  lib/w32sock.h -> tests/w32sock.h
  lib/wcrtomb.c -> tests/wcrtomb.c
  lib/wctob.c -> tests/wctob.c
  lib/wctomb-impl.h -> tests/wctomb-impl.h
  lib/wctomb.c -> tests/wctomb.c
Finished.

You may need to add #include directives for the following .h files.
  #include <byteswap.h>
  #include <fcntl.h>
  #include <glob.h>
  #include <netdb.h>
  #include <stdio.h>
  #include <stdlib.h>
  #include <string.h>
  #include <sys/select.h>
  #include <sys/socket.h>
  #include <sys/stat.h>
  #include <sys/wait.h>
  #include <unistd.h>
  #include "c-ctype.h"
  #include "error.h"
  #include "fsusage.h"
  #include "hash.h"
  #include "ignore-value.h"
  #include "openat.h"
  #include "read-file.h"

You may need to use the following Makefile variables when linking.
Use them in <program>_LDADD when linking a program, or
in <library>_a_LDFLAGS or <library>_la_LDFLAGS when linking a library.
  $(GETADDRINFO_LIB)
  $(HOSTENT_LIB)
  $(INET_NTOP_LIB)
  $(LIBSOCKET)
  $(LIB_CLOCK_GETTIME)
  $(LTLIBINTL) when linking with libtool, $(LIBINTL) otherwise
  $(LTLIBTHREAD) when linking with libtool, $(LIBTHREAD) otherwise
  $(SERVENT_LIB)

Don't forget to
  - add "lib/Makefile" to AC_CONFIG_FILES in ./configure.ac,
  - add "tests/Makefile" to AC_CONFIG_FILES in ./configure.ac,
  - mention "lib" in SUBDIRS in Makefile.am,
  - mention "tests" in SUBDIRS in Makefile.am,
  - mention "-I m4" in ACLOCAL_AMFLAGS in Makefile.am,
  - mention "m4/gnulib-cache.m4" in EXTRA_DIST in Makefile.am,
  - invoke gl_EARLY in ./configure.ac, right after AC_PROG_CC,
  - invoke gl_INIT in ./configure.ac.
Module list with included dependencies (indented):
    alignof
    alignof-tests
    alloca-opt
    alloca-opt-tests
    arg-nonnull
    argmatch
    argmatch-tests
  arpa_inet
    arpa_inet-tests
    binary-io
    binary-io-tests
    bitrotate
    bitrotate-tests
    btowc
    btowc-tests
    c++defs
  c-ctype
    c-ctype-tests
    chdir-long
    chown
    chown-tests
    cloexec
    cloexec-tests
    close
    close-stream
  closeout
    configmake
    cycle-check
    d-ino
    d-type
    dev-ino
    dirent
    dirent-safer
    dirent-safer-tests
    dirent-tests
    dirfd
    dirname-lgpl
    dosname
    double-slash-root
    dup2
    dup2-tests
    environ
    environ-tests
    errno
    errno-tests
  error
    exitfail
    extensions
    fchdir
    fchdir-tests
    fclose
    fclose-tests
    fcntl
    fcntl-h
    fcntl-h-tests
    fcntl-safer
    fcntl-safer-tests
    fcntl-tests
    fd-hook
    fd-safer-flag
    fdopendir
    fdopendir-tests
    fflush
    fflush-tests
    filenamecat-lgpl
  filevercmp
    filevercmp-tests
    float
    fpending
    fpending-tests
    fpurge
    fpurge-tests
    freading
    freading-tests
    fseeko
    fseeko-tests
    ftell
    ftell-tests
    ftello
    ftello-tests
  fts
  full-read
  full-write
    getcwd-lgpl
    getcwd-lgpl-tests
    getdtablesize
    getdtablesize-tests
    getgroups
    getgroups-tests
    getopt-gnu
    getopt-posix
    getopt-posix-tests
    getpagesize
    gettext-h
    getugroups
  gitlog-to-changelog
  gnu-make
  gnumakefile
  hash
  hash-pjw
    hash-tests
    havelib
  human
    i-ring
    i-ring-tests
  ignore-value
    ignore-value-tests
    include_next
    inline
    intprops
    intprops-tests
    inttostr
    inttostr-tests
    inttypes
    inttypes-incomplete
    inttypes-tests
    lchown
    lchown-tests
    localcharset
    locale
    locale-tests
    localename
    localename-tests
  lock
    lock-tests
    lseek
    lseek-tests
    lstat
    lstat-tests
  maintainer-makefile
    malloc-posix
    malloca
    malloca-tests
  manywarnings
    mbrtowc
    mbrtowc-tests
    mbsinit
    mbsinit-tests
    mbtowc
    memchr
    memchr-tests
    mempcpy
    memrchr
    memrchr-tests
    mgetgroups
    mkdir
    mkdir-tests
    multiarch
  netinet_in
    netinet_in-tests
    open
    open-tests
    openat
    openat-die
    openat-safer
    openat-safer-tests
    openat-tests
    pathmax
    priv-set
    priv-set-tests
  progname
    putenv
    quote
    quotearg
    quotearg-simple
    quotearg-simple-tests
    rawmemchr
    rawmemchr-tests
    read
    realloc-gnu
    realloc-gnu-tests
    realloc-posix
    rmdir
    rmdir-tests
    safe-read
    safe-write
    same-inode
    save-cwd
  setenv
    setenv-tests
    setlocale
    setlocale-tests
    size_max
    sleep
    sleep-tests
    snprintf
    snprintf-tests
    socklen
    ssize_t
    stat
    stat-tests
    stat-time
    stat-time-tests
    stdarg
    stdbool
    stdbool-tests
    stddef
    stddef-tests
    stdint
    stdint-tests
    stdio
    stdio-tests
    stdlib
    stdlib-tests
  strchrnul
    strchrnul-tests
    strdup-posix
    streq
  strerror
    strerror-override
    strerror-tests
    string
    string-tests
  strndup
    strnlen
    strnlen-tests
    strtoll
    strtoull
    strtoumax
    symlink
    symlink-tests
    sys_socket
    sys_socket-tests
    sys_stat
    sys_stat-tests
    sys_uio
    sys_uio-tests
    thread
    threadlib
    time
    time-tests
    unistd
    unistd-safer
    unistd-safer-tests
    unistd-tests
    unlink
    unlink-tests
    unlinkdir
    unsetenv
    unsetenv-tests
    useless-if-before-free
    usleep
    usleep-tests
    vasnprintf
    vasnprintf-tests
  vasprintf
    vasprintf-tests
  vc-list-files
    vc-list-files-tests
    verify
    verify-tests
    warn-on-use
  warnings
    wchar
    wchar-tests
    wcrtomb
    wcrtomb-tests
    wctob
    wctomb
    wctype-h
    wctype-h-tests
    write
  xalloc
  xalloc-die
    xalloc-die-tests
    xalloc-oversized
    xsize
  xstrtol
    xstrtol-tests
  xstrtoll
    xstrtoll-tests
    xstrtoumax
    xstrtoumax-tests
  xvasprintf
    xvasprintf-tests
    yield
Notice from module error:
  If you are using GNU gettext version 0.16.1 or older, add the following options
  to XGETTEXT_OPTIONS in your po/Makevars:
    --flag=error:3:c-format --flag=error_at_line:5:c-format
Notice from module localcharset:
  If your package's tests make use of the locale_charset() function directly or
  indirectly, you may need to define the CHARSETALIASDIR environment variable,
  so that "make check" works before "make install". In Makefile.am syntax:
  TESTS_ENVIRONMENT += @LOCALCHARSET_TESTS_ENVIRONMENT@
Notice from module vasprintf:
  If you are using GNU gettext version 0.16.1 or older, add the following options
  to XGETTEXT_OPTIONS in your po/Makevars:
    --flag=asprintf:2:c-format --flag=vasprintf:2:c-format
Notice from module xvasprintf:
  If you are using GNU gettext version 0.16.1 or older, add the following options
  to XGETTEXT_OPTIONS in your po/Makevars: --flag=xasprintf:1:c-format
File list:
  build-aux/arg-nonnull.h
  build-aux/c++defs.h
  build-aux/config.rpath
  build-aux/gitlog-to-changelog
  build-aux/useless-if-before-free
  build-aux/vc-list-files
  build-aux/warn-on-use.h
  lib/alignof.h
  lib/alloca.in.h
  lib/argmatch.c
  lib/argmatch.h
  lib/arpa_inet.in.h
  lib/asnprintf.c
  lib/asprintf.c
  lib/at-func.c
  lib/basename-lgpl.c
  lib/bitrotate.h
  lib/c-ctype.c
  lib/c-ctype.h
  lib/chdir-long.c
  lib/chdir-long.h
  lib/chown.c
  lib/cloexec.c
  lib/cloexec.h
  lib/close-stream.c
  lib/close-stream.h
  lib/close.c
  lib/closeout.c
  lib/closeout.h
  lib/config.charset
  lib/creat-safer.c
  lib/cycle-check.c
  lib/cycle-check.h
  lib/dev-ino.h
  lib/dirent--.h
  lib/dirent-safer.h
  lib/dirent.in.h
  lib/dirfd.c
  lib/dirname-lgpl.c
  lib/dirname.h
  lib/dosname.h
  lib/dup-safer.c
  lib/dup2.c
  lib/errno.in.h
  lib/error.c
  lib/error.h
  lib/exitfail.c
  lib/exitfail.h
  lib/fchdir.c
  lib/fchmodat.c
  lib/fchown-stub.c
  lib/fchownat.c
  lib/fclose.c
  lib/fcntl--.h
  lib/fcntl-safer.h
  lib/fcntl.c
  lib/fcntl.in.h
  lib/fd-hook.c
  lib/fd-hook.h
  lib/fd-safer.c
  lib/fdopendir.c
  lib/fflush.c
  lib/filenamecat-lgpl.c
  lib/filenamecat.h
  lib/filevercmp.c
  lib/filevercmp.h
  lib/float+.h
  lib/float.in.h
  lib/fpending.c
  lib/fpending.h
  lib/fpurge.c
  lib/freading.c
  lib/freading.h
  lib/fseeko.c
  lib/fstatat.c
  lib/ftello.c
  lib/fts-cycle.c
  lib/fts.c
  lib/fts_.h
  lib/full-read.c
  lib/full-read.h
  lib/full-write.c
  lib/full-write.h
  lib/getcwd-lgpl.c
  lib/getdtablesize.c
  lib/getopt.c
  lib/getopt.in.h
  lib/getopt1.c
  lib/getopt_int.h
  lib/gettext.h
  lib/glthread/lock.c
  lib/glthread/lock.h
  lib/glthread/threadlib.c
  lib/hash-pjw.c
  lib/hash-pjw.h
  lib/hash.c
  lib/hash.h
  lib/human.c
  lib/human.h
  lib/i-ring.c
  lib/i-ring.h
  lib/ignore-value.h
  lib/intprops.h
  lib/inttypes.in.h
  lib/lchown.c
  lib/localcharset.c
  lib/localcharset.h
  lib/lseek.c
  lib/lstat.c
  lib/malloc.c
  lib/malloca.c
  lib/malloca.h
  lib/malloca.valgrind
  lib/mbrtowc.c
  lib/mbsinit.c
  lib/memchr.c
  lib/memchr.valgrind
  lib/mempcpy.c
  lib/memrchr.c
  lib/mkdir.c
  lib/mkdirat.c
  lib/netinet_in.in.h
  lib/open-safer.c
  lib/open.c
  lib/openat-die.c
  lib/openat-priv.h
  lib/openat-proc.c
  lib/openat-safer.c
  lib/openat.c
  lib/openat.h
  lib/opendir-safer.c
  lib/pipe-safer.c
  lib/printf-args.c
  lib/printf-args.h
  lib/printf-parse.c
  lib/printf-parse.h
  lib/progname.c
  lib/progname.h
  lib/quote.c
  lib/quote.h
  lib/quotearg.c
  lib/quotearg.h
  lib/rawmemchr.c
  lib/rawmemchr.valgrind
  lib/read.c
  lib/realloc.c
  lib/ref-add.sin
  lib/ref-del.sin
  lib/rmdir.c
  lib/safe-read.c
  lib/safe-read.h
  lib/safe-write.c
  lib/safe-write.h
  lib/same-inode.h
  lib/save-cwd.c
  lib/save-cwd.h
  lib/setenv.c
  lib/size_max.h
  lib/stat.c
  lib/stdarg.in.h
  lib/stdbool.in.h
  lib/stddef.in.h
  lib/stdint.in.h
  lib/stdio-impl.h
  lib/stdio.in.h
  lib/stdlib.in.h
  lib/strchrnul.c
  lib/strchrnul.valgrind
  lib/strdup.c
  lib/streq.h
  lib/strerror-override.c
  lib/strerror-override.h
  lib/strerror.c
  lib/string.in.h
  lib/stripslash.c
  lib/strndup.c
  lib/strnlen.c
  lib/strtoimax.c
  lib/strtol.c
  lib/strtoll.c
  lib/strtoul.c
  lib/strtoull.c
  lib/strtoumax.c
  lib/sys_socket.in.h
  lib/sys_stat.in.h
  lib/sys_uio.in.h
  lib/time.in.h
  lib/unistd--.h
  lib/unistd-safer.h
  lib/unistd.in.h
  lib/unlink.c
  lib/unlinkat.c
  lib/vasnprintf.c
  lib/vasnprintf.h
  lib/vasprintf.c
  lib/verify.h
  lib/wchar.in.h
  lib/wctype.in.h
  lib/write.c
  lib/xalloc-die.c
  lib/xalloc-oversized.h
  lib/xalloc.h
  lib/xasprintf.c
  lib/xmalloc.c
  lib/xsize.h
  lib/xstrtol-error.c
  lib/xstrtol.c
  lib/xstrtol.h
  lib/xstrtoll.c
  lib/xstrtoul.c
  lib/xstrtoull.c
  lib/xstrtoumax.c
  lib/xvasprintf.c
  lib/xvasprintf.h
  m4/00gnulib.m4
  m4/alloca.m4
  m4/argmatch.m4
  m4/arpa_inet_h.m4
  m4/btowc.m4
  m4/chdir-long.m4
  m4/chown.m4
  m4/cloexec.m4
  m4/close-stream.m4
  m4/close.m4
  m4/closeout.m4
  m4/codeset.m4
  m4/configmake.m4
  m4/cycle-check.m4
  m4/d-ino.m4
  m4/d-type.m4
  m4/dirent-safer.m4
  m4/dirent_h.m4
  m4/dirfd.m4
  m4/dirname.m4
  m4/double-slash-root.m4
  m4/dup2.m4
  m4/eealloc.m4
  m4/environ.m4
  m4/errno_h.m4
  m4/error.m4
  m4/extensions.m4
  m4/fchdir.m4
  m4/fclose.m4
  m4/fcntl-o.m4
  m4/fcntl-safer.m4
  m4/fcntl.m4
  m4/fcntl_h.m4
  m4/fdopendir.m4
  m4/fflush.m4
  m4/filenamecat.m4
  m4/float_h.m4
  m4/fpending.m4
  m4/fpurge.m4
  m4/freading.m4
  m4/fseeko.m4
  m4/ftell.m4
  m4/ftello.m4
  m4/fts.m4
  m4/getcwd.m4
  m4/getdtablesize.m4
  m4/getgroups.m4
  m4/getopt.m4
  m4/getpagesize.m4
  m4/getugroups.m4
  m4/glibc21.m4
  m4/gnu-make.m4
  m4/gnulib-common.m4
  m4/hash.m4
  m4/human.m4
  m4/i-ring.m4
  m4/include_next.m4
  m4/inline.m4
  m4/intlmacosx.m4
  m4/intmax_t.m4
  m4/inttostr.m4
  m4/inttypes-pri.m4
  m4/inttypes.m4
  m4/inttypes_h.m4
  m4/lchown.m4
  m4/lcmessage.m4
  m4/lib-ld.m4
  m4/lib-link.m4
  m4/lib-prefix.m4
  m4/localcharset.m4
  m4/locale-fr.m4
  m4/locale-ja.m4
  m4/locale-zh.m4
  m4/locale_h.m4
  m4/localename.m4
  m4/lock.m4
  m4/longlong.m4
  m4/lseek.m4
  m4/lstat.m4
  m4/malloc.m4
  m4/malloca.m4
  m4/manywarnings.m4
  m4/mbrtowc.m4
  m4/mbsinit.m4
  m4/mbstate_t.m4
  m4/mbtowc.m4
  m4/memchr.m4
  m4/mempcpy.m4
  m4/memrchr.m4
  m4/mgetgroups.m4
  m4/mkdir.m4
  m4/mmap-anon.m4
  m4/mode_t.m4
  m4/multiarch.m4
  m4/netinet_in_h.m4
  m4/onceonly.m4
  m4/open.m4
  m4/openat.m4
  m4/pathmax.m4
  m4/printf.m4
  m4/priv-set.m4
  m4/putenv.m4
  m4/quote.m4
  m4/quotearg.m4
  m4/rawmemchr.m4
  m4/read.m4
  m4/realloc.m4
  m4/rmdir.m4
  m4/safe-read.m4
  m4/safe-write.m4
  m4/save-cwd.m4
  m4/setenv.m4
  m4/setlocale.m4
  m4/size_max.m4
  m4/sleep.m4
  m4/snprintf.m4
  m4/socklen.m4
  m4/sockpfaf.m4
  m4/ssize_t.m4
  m4/stat-time.m4
  m4/stat.m4
  m4/stdarg.m4
  m4/stdbool.m4
  m4/stddef_h.m4
  m4/stdint.m4
  m4/stdint_h.m4
  m4/stdio_h.m4
  m4/stdlib_h.m4
  m4/strchrnul.m4
  m4/strdup.m4
  m4/strerror.m4
  m4/string_h.m4
  m4/strndup.m4
  m4/strnlen.m4
  m4/strtoll.m4
  m4/strtoull.m4
  m4/strtoumax.m4
  m4/symlink.m4
  m4/sys_socket_h.m4
  m4/sys_stat_h.m4
  m4/sys_uio_h.m4
  m4/thread.m4
  m4/threadlib.m4
  m4/time_h.m4
  m4/ungetc.m4
  m4/unistd-safer.m4
  m4/unistd_h.m4
  m4/unlink.m4
  m4/unlinkdir.m4
  m4/usleep.m4
  m4/vasnprintf.m4
  m4/vasprintf.m4
  m4/warn-on-use.m4
  m4/warnings.m4
  m4/wchar_h.m4
  m4/wchar_t.m4
  m4/wcrtomb.m4
  m4/wctob.m4
  m4/wctomb.m4
  m4/wctype_h.m4
  m4/wint_t.m4
  m4/write.m4
  m4/xalloc.m4
  m4/xsize.m4
  m4/xstrtol.m4
  m4/xvasprintf.m4
  m4/yield.m4
  tests/init.sh
  tests/macros.h
  tests/nap.h
  tests/signature.h
  tests/test-alignof.c
  tests/test-alloca-opt.c
  tests/test-argmatch.c
  tests/test-arpa_inet.c
  tests/test-binary-io.c
  tests/test-binary-io.sh
  tests/test-bitrotate.c
  tests/test-btowc.c
  tests/test-btowc1.sh
  tests/test-btowc2.sh
  tests/test-c-ctype.c
  tests/test-chown.c
  tests/test-chown.h
  tests/test-cloexec.c
  tests/test-dirent-safer.c
  tests/test-dirent.c
  tests/test-dup-safer.c
  tests/test-dup2.c
  tests/test-environ.c
  tests/test-errno.c
  tests/test-fchdir.c
  tests/test-fchownat.c
  tests/test-fclose.c
  tests/test-fcntl-h.c
  tests/test-fcntl-safer.c
  tests/test-fcntl.c
  tests/test-fdopendir.c
  tests/test-fflush.c
  tests/test-fflush2.c
  tests/test-fflush2.sh
  tests/test-filevercmp.c
  tests/test-fpending.c
  tests/test-fpending.sh
  tests/test-fpurge.c
  tests/test-freading.c
  tests/test-fseeko.c
  tests/test-fseeko.sh
  tests/test-fseeko2.sh
  tests/test-fstatat.c
  tests/test-ftell.c
  tests/test-ftell.sh
  tests/test-ftell2.sh
  tests/test-ftell3.c
  tests/test-ftello.c
  tests/test-ftello.sh
  tests/test-ftello2.sh
  tests/test-ftello3.c
  tests/test-getcwd-lgpl.c
  tests/test-getdtablesize.c
  tests/test-getgroups.c
  tests/test-getopt.c
  tests/test-getopt.h
  tests/test-getopt_long.h
  tests/test-hash.c
  tests/test-i-ring.c
  tests/test-ignore-value.c
  tests/test-intprops.c
  tests/test-inttostr.c
  tests/test-inttypes.c
  tests/test-lchown.c
  tests/test-lchown.h
  tests/test-locale.c
  tests/test-localename.c
  tests/test-lock.c
  tests/test-lseek.c
  tests/test-lseek.sh
  tests/test-lstat.c
  tests/test-lstat.h
  tests/test-malloca.c
  tests/test-mbrtowc-w32-1.sh
  tests/test-mbrtowc-w32-2.sh
  tests/test-mbrtowc-w32-3.sh
  tests/test-mbrtowc-w32-4.sh
  tests/test-mbrtowc-w32-5.sh
  tests/test-mbrtowc-w32.c
  tests/test-mbrtowc.c
  tests/test-mbrtowc1.sh
  tests/test-mbrtowc2.sh
  tests/test-mbrtowc3.sh
  tests/test-mbrtowc4.sh
  tests/test-mbsinit.c
  tests/test-mbsinit.sh
  tests/test-memchr.c
  tests/test-memrchr.c
  tests/test-mkdir.c
  tests/test-mkdir.h
  tests/test-mkdirat.c
  tests/test-netinet_in.c
  tests/test-open.c
  tests/test-open.h
  tests/test-openat-safer.c
  tests/test-openat.c
  tests/test-priv-set.c
  tests/test-quotearg-simple.c
  tests/test-quotearg.h
  tests/test-rawmemchr.c
  tests/test-realloc-gnu.c
  tests/test-rmdir.c
  tests/test-rmdir.h
  tests/test-setenv.c
  tests/test-setlocale1.c
  tests/test-setlocale1.sh
  tests/test-setlocale2.c
  tests/test-setlocale2.sh
  tests/test-sleep.c
  tests/test-snprintf.c
  tests/test-stat-time.c
  tests/test-stat.c
  tests/test-stat.h
  tests/test-stdbool.c
  tests/test-stddef.c
  tests/test-stdint.c
  tests/test-stdio.c
  tests/test-stdlib.c
  tests/test-strchrnul.c
  tests/test-strerror.c
  tests/test-string.c
  tests/test-strnlen.c
  tests/test-symlink.c
  tests/test-symlink.h
  tests/test-sys_socket.c
  tests/test-sys_stat.c
  tests/test-sys_uio.c
  tests/test-sys_wait.h
  tests/test-time.c
  tests/test-unistd.c
  tests/test-unlink.c
  tests/test-unlink.h
  tests/test-unlinkat.c
  tests/test-unsetenv.c
  tests/test-usleep.c
  tests/test-vasnprintf.c
  tests/test-vasprintf.c
  tests/test-vc-list-files-cvs.sh
  tests/test-vc-list-files-git.sh
  tests/test-verify.c
  tests/test-verify.sh
  tests/test-wchar.c
  tests/test-wcrtomb-w32-1.sh
  tests/test-wcrtomb-w32-2.sh
  tests/test-wcrtomb-w32-3.sh
  tests/test-wcrtomb-w32-4.sh
  tests/test-wcrtomb-w32-5.sh
  tests/test-wcrtomb-w32.c
  tests/test-wcrtomb.c
  tests/test-wcrtomb.sh
  tests/test-wctype-h.c
  tests/test-xalloc-die.c
  tests/test-xalloc-die.sh
  tests/test-xstrtol.c
  tests/test-xstrtol.sh
  tests/test-xstrtoll.c
  tests/test-xstrtoll.sh
  tests/test-xstrtoul.c
  tests/test-xstrtoull.c
  tests/test-xstrtoumax.c
  tests/test-xstrtoumax.sh
  tests/test-xvasprintf.c
  tests/zerosize-ptr.h
  lib/anytostr.c -> tests/anytostr.c
  lib/binary-io.h -> tests/binary-io.h
  lib/btowc.c -> tests/btowc.c
  lib/dup-safer-flag.c -> tests/dup-safer-flag.c
  lib/fd-safer-flag.c -> tests/fd-safer-flag.c
  lib/ftell.c -> tests/ftell.c
  lib/getgroups.c -> tests/getgroups.c
  lib/getpagesize.c -> tests/getpagesize.c
  lib/getugroups.c -> tests/getugroups.c
  lib/getugroups.h -> tests/getugroups.h
  lib/glthread/thread.c -> tests/glthread/thread.c
  lib/glthread/thread.h -> tests/glthread/thread.h
  lib/glthread/yield.h -> tests/glthread/yield.h
  lib/imaxtostr.c -> tests/imaxtostr.c
  lib/inttostr.c -> tests/inttostr.c
  lib/inttostr.h -> tests/inttostr.h
  lib/locale.in.h -> tests/locale.in.h
  lib/localename.c -> tests/localename.c
  lib/localename.h -> tests/localename.h
  lib/mbtowc-impl.h -> tests/mbtowc-impl.h
  lib/mbtowc.c -> tests/mbtowc.c
  lib/mgetgroups.c -> tests/mgetgroups.c
  lib/mgetgroups.h -> tests/mgetgroups.h
  lib/offtostr.c -> tests/offtostr.c
  lib/pathmax.h -> tests/pathmax.h
  lib/priv-set.c -> tests/priv-set.c
  lib/priv-set.h -> tests/priv-set.h
  lib/putenv.c -> tests/putenv.c
  lib/realloc.c -> tests/realloc.c
  lib/setlocale.c -> tests/setlocale.c
  lib/sleep.c -> tests/sleep.c
  lib/snprintf.c -> tests/snprintf.c
  lib/stat-time.h -> tests/stat-time.h
  lib/symlink.c -> tests/symlink.c
  lib/uinttostr.c -> tests/uinttostr.c
  lib/umaxtostr.c -> tests/umaxtostr.c
  lib/unlinkdir.c -> tests/unlinkdir.c
  lib/unlinkdir.h -> tests/unlinkdir.h
  lib/unsetenv.c -> tests/unsetenv.c
  lib/usleep.c -> tests/usleep.c
  lib/wcrtomb.c -> tests/wcrtomb.c
  lib/wctob.c -> tests/wctob.c
  lib/wctomb-impl.h -> tests/wctomb-impl.h
  lib/wctomb.c -> tests/wctomb.c
  top/GNUmakefile
  top/maint.mk
Finished.

You may need to add #include directives for the following .h files.
  #include <arpa/inet.h>
  #include <netinet/in.h>
  #include <stdio.h>
  #include <stdlib.h>
  #include <string.h>
  #include "c-ctype.h"
  #include "closeout.h"
  #include "error.h"
  #include "filevercmp.h"
  #include "fts_.h"
  #include "full-read.h"
  #include "full-write.h"
  #include "glthread/lock.h"
  #include "hash-pjw.h"
  #include "hash.h"
  #include "human.h"
  #include "ignore-value.h"
  #include "progname.h"
  #include "xalloc.h"
  #include "xstrtol.h"
  #include "xvasprintf.h"

You may need to use the following Makefile variables when linking.
Use them in <program>_LDADD when linking a program, or
in <library>_a_LDFLAGS or <library>_la_LDFLAGS when linking a library.
  $(LTLIBINTL) when linking with libtool, $(LIBINTL) otherwise
  $(LTLIBTHREAD) when linking with libtool, $(LIBTHREAD) otherwise

Don't forget to
  - add "gnulib/lib/Makefile" to AC_CONFIG_FILES in ./configure.ac,
  - add "gnulib/tests/Makefile" to AC_CONFIG_FILES in ./configure.ac,
  - mention "lib" in SUBDIRS in gnulib/Makefile.am,
  - mention "tests" in SUBDIRS in gnulib/Makefile.am,
  - mention "-I m4" in ACLOCAL_AMFLAGS in Makefile.am,
  - mention "m4/gnulib-cache.m4" in EXTRA_DIST in Makefile.am,
  - invoke gl_EARLY in ./configure.ac, right after AC_PROG_CC,
  - invoke gl_INIT in ./configure.ac.
autoreconf: Entering directory `.'
autoreconf: configure.ac: not using Gettext
autoreconf: running: aclocal -I m4
autoreconf: configure.ac: tracing
autoreconf: configure.ac: adding subdirectory daemon to autoreconf
autoreconf: Entering directory `daemon'
autoreconf: configure.ac: not using Libtool
autoreconf: running: /usr/bin/autoconf
autoreconf: running: /usr/bin/autoheader
autoreconf: running: automake --add-missing --copy --no-force
autoreconf: Leaving directory `daemon'
autoreconf: configure.ac: AM_GNU_GETTEXT is used, but not AM_GNU_GETTEXT_VERSION
autoreconf: running: true --copy
perl/Makefile.am:43: .PHONY was already defined in condition TRUE, which includes condition HAVE_PERL ...
subdir-rules.mk:19: ... `.PHONY' previously defined here
perl/Makefile.am:18:   `subdir-rules.mk' included from here
perl/Makefile.am:47: .PHONY was already defined in condition TRUE, which includes condition HAVE_PERL ...
subdir-rules.mk:19: ... `.PHONY' previously defined here
perl/Makefile.am:18:   `subdir-rules.mk' included from here
resize/Makefile.am:102: .PHONY was already defined in condition TRUE, which includes condition HAVE_OCAML_PCRE and HAVE_OCAML ...
subdir-rules.mk:19: ... `.PHONY' previously defined here
resize/Makefile.am:18:   `subdir-rules.mk' included from here
automake: SOURCES was already defined in condition HAVE_OCAML_PCRE and HAVE_OCAML, which is included in condition TRUE ...
resize/Makefile.am:31: ... `SOURCES' previously defined here
autoreconf: Leaving directory `.'
+ ./autogen.sh --enable-gcc-warnings

# Ensure that whenever we pull in a gnulib update or otherwise change to a
# different version (i.e., when switching branches), we also rerun ./bootstrap.
curr_status=.git-module-status
t=$(git submodule status|sed 's/^[ +-]//;s/ .*//')
git submodule status|sed 's/^[ +-]//;s/ .*//'
if test "$t" = "$(cat $curr_status 2>/dev/null)"; then
    : # good, it's up to date
else
    echo running bootstrap...
    ./bootstrap && echo "$t" > $curr_status
fi
cat $curr_status 2>/dev/null

CONFIGUREDIR=.

# Run configure in BUILDDIR if it's set
if [ ! -z "$BUILDDIR" ]; then
    mkdir -p $BUILDDIR
    cd $BUILDDIR

    CONFIGUREDIR=..
fi

# If no arguments were specified and configure has run before, use the previous
# arguments
if test $# == 0 && test -x ./config.status; then
    ./config.status --recheck
else
    $CONFIGUREDIR/configure "$@"
fi
checking for a BSD-compatible install... /usr/bin/install -c
checking whether build environment is sane... yes
checking for a thread-safe mkdir -p... /bin/mkdir -p
checking for gawk... gawk
checking whether make sets $(MAKE)... yes
checking if this is a stable or unstable branch of libguestfs... unstable
configure:
***
This is a development version of libguestfs. Some APIs may be unstable
until they appear in a stable release of libguestfs (at which point
the C API and ABI is guaranteed to remain stable forever).  For
more information about stable and development branches of libguestfs
please see the section "LIBGUESTFS VERSION NUMBERS" in guestfs(3).
***
checking for ranlib... ranlib
checking for style of include used by make... GNU
checking for gcc... gcc
checking whether the C compiler works... yes
checking for C compiler default output file name... a.out
checking for suffix of executables... 
checking whether we are cross compiling... no
checking for suffix of object files... o
checking whether we are using the GNU C compiler... yes
checking whether gcc accepts -g... yes
checking for gcc option to accept ISO C89... none needed
checking dependency style of gcc... gcc3
checking whether gcc and cc understand -c and -o together... yes
checking build system type... x86_64-unknown-linux-gnu
checking host system type... x86_64-unknown-linux-gnu
checking how to run the C preprocessor... gcc -E
checking for grep that handles long lines and -e... /bin/grep
checking for egrep... /bin/grep -E
checking for ANSI C header files... yes
checking for sys/types.h... yes
checking for sys/stat.h... yes
checking for stdlib.h... yes
checking for string.h... yes
checking for memory.h... yes
checking for strings.h... yes
checking for inttypes.h... yes
checking for stdint.h... yes
checking for unistd.h... yes
checking minix/config.h usability... no
checking minix/config.h presence... no
checking for minix/config.h... no
checking whether it is safe to define __EXTENSIONS__... yes
checking for _LARGEFILE_SOURCE value needed for large files... no
checking for gcc option to accept ISO C99... -std=gnu99
checking for gcc -std=gnu99 option to accept ISO Standard C... (cached) -std=gnu99
checking for working alloca.h... yes
checking for alloca... yes
checking arpa/inet.h usability... yes
checking arpa/inet.h presence... yes
checking for arpa/inet.h... yes
checking features.h usability... yes
checking features.h presence... yes
checking for features.h... yes
checking sys/socket.h usability... yes
checking sys/socket.h presence... yes
checking for sys/socket.h... yes
checking dirent.h usability... yes
checking dirent.h presence... yes
checking for dirent.h... yes
checking stdio_ext.h usability... yes
checking stdio_ext.h presence... yes
checking for stdio_ext.h... yes
checking sys/param.h usability... yes
checking sys/param.h presence... yes
checking for sys/param.h... yes
checking sys/vfs.h usability... yes
checking sys/vfs.h presence... yes
checking for sys/vfs.h... yes
checking getopt.h usability... yes
checking getopt.h presence... yes
checking for getopt.h... yes
checking wchar.h usability... yes
checking wchar.h presence... yes
checking for wchar.h... yes
checking for stdint.h... (cached) yes
checking for inttypes.h... (cached) yes
checking sys/mman.h usability... yes
checking sys/mman.h presence... yes
checking for sys/mman.h... yes
checking for unistd.h... (cached) yes
checking netinet/in.h usability... yes
checking netinet/in.h presence... yes
checking for netinet/in.h... yes
checking for sys/stat.h... (cached) yes
checking sys/uio.h usability... yes
checking sys/uio.h presence... yes
checking for sys/uio.h... yes
checking sys/time.h usability... yes
checking sys/time.h presence... yes
checking for sys/time.h... yes
checking wctype.h usability... yes
checking wctype.h presence... yes
checking for wctype.h... yes
checking grp.h usability... yes
checking grp.h presence... yes
checking for grp.h... yes
checking xlocale.h usability... yes
checking xlocale.h presence... yes
checking for xlocale.h... yes
checking priv.h usability... no
checking priv.h presence... no
checking for priv.h... no
checking whether the preprocessor supports include_next... yes
checking whether system header files limit the line length... no
checking for inline... inline
checking for uid_t in sys/types.h... yes
checking for unistd.h... (cached) yes
checking for working chown... yes
checking whether chown dereferences symlinks... yes
checking for chown... yes
checking for fchown... yes
checking for fdopendir... yes
checking for fcntl... yes
checking for dup2... yes
checking for fchdir... yes
checking for mempcpy... yes
checking for __fpending... yes
checking for fpurge... no
checking for __fpurge... yes
checking for __freading... yes
checking for lchmod... no
checking for fstatfs... yes
checking for getdtablesize... yes
checking for lstat... yes
checking for mbsinit... yes
checking for mbrtowc... yes
checking for mprotect... yes
checking for setenv... yes
checking for strdup... yes
checking for strndup... yes
checking for pipe... yes
checking for vasnprintf... no
checking for iswcntrl... yes
checking for btowc... yes
checking for getegid... yes
checking for newlocale... yes
checking for getgrouplist... yes
checking for pathconf... yes
checking for sleep... yes
checking for symlink... yes
checking for shutdown... yes
checking for usleep... yes
checking for wcrtomb... yes
checking for wctob... yes
checking whether chown honors trailing slash... yes
checking whether chown always updates ctime... yes
checking whether // is distinct from /... no
checking if environ is properly declared... yes
checking for complete errno.h... yes
checking whether strerror_r is declared... yes
checking for strerror_r... yes
checking whether strerror_r returns char *... yes
checking whether fchdir is declared... yes
checking for mode_t... yes
checking for promoted mode_t type... mode_t
checking for working fcntl.h... yes
checking for fseeko... yes
checking whether stdin defaults to large file offsets... yes
checking whether fseeko is declared... yes
checking whether ftello is declared... yes
checking whether lstat correctly handles trailing slash... yes
checking whether unlink honors trailing slashes... yes
checking whether unlink of a parent directory fails as it should... guessing yes
checking whether getcwd (NULL, 0) allocates memory for result... yes
checking for getopt.h... (cached) yes
checking for getopt_long_only... yes
checking whether getopt is POSIX compatible... yes
checking for working GNU getopt function... yes
checking whether getenv is declared... yes
checking for unsigned long long int... yes
checking for long long int... yes
checking whether stdint.h conforms to C99... yes
checking whether imaxabs is declared without a macro... yes
checking whether imaxdiv is declared without a macro... yes
checking whether strtoimax is declared without a macro... yes
checking whether strtoumax is declared without a macro... yes
checking for nl_langinfo and CODESET... yes
checking whether getc_unlocked is declared... yes
checking whether we are using the GNU C Library >= 2.1 or uClibc... yes
checking for ld used by GCC... /usr/bin/ld
checking if the linker (/usr/bin/ld) is GNU ld... yes
checking for shared library run path origin... done
checking whether imported symbols can be declared weak... yes
checking pthread.h usability... yes
checking pthread.h presence... yes
checking for pthread.h... yes
checking for pthread_kill in -lpthread... yes
checking for multithread API to use... posix
checking whether malloc, realloc, calloc are POSIX compliant... yes
checking for stdlib.h... (cached) yes
checking for GNU libc compatible malloc... yes
checking for mbstate_t... yes
checking for a traditional japanese locale... none
checking for a transitional chinese locale... none
checking for a french Unicode locale... none
checking for mmap... yes
checking for MAP_ANONYMOUS... yes
checking whether memchr works... yes
checking for C/C++ restrict keyword... __restrict
checking whether memrchr is declared... yes
checking for ssize_t... yes
checking whether setenv is declared... yes
checking search.h usability... yes
checking search.h presence... yes
checking for search.h... yes
checking for tsearch... yes
checking for stdbool.h that conforms to C99... yes
checking for _Bool... yes
checking for wchar_t... yes
checking whether strdup is declared... yes
checking whether memmem is declared without a macro... yes
checking whether mempcpy is declared without a macro... yes
checking whether memrchr is declared without a macro... yes
checking whether rawmemchr is declared without a macro... yes
checking whether stpcpy is declared without a macro... yes
checking whether stpncpy is declared without a macro... yes
checking whether strchrnul is declared without a macro... yes
checking whether strdup is declared without a macro... yes
checking whether strncat is declared without a macro... yes
checking whether strndup is declared without a macro... yes
checking whether strnlen is declared without a macro... yes
checking whether strpbrk is declared without a macro... yes
checking whether strsep is declared without a macro... yes
checking whether strcasestr is declared without a macro... yes
checking whether strtok_r is declared without a macro... yes
checking whether strerror_r is declared without a macro... yes
checking whether strsignal is declared without a macro... yes
checking whether strverscmp is declared without a macro... yes
checking whether strndup is declared... (cached) yes
checking whether strnlen is declared... (cached) yes
checking whether strtoumax is declared... (cached) yes
checking whether stat file-mode macros are broken... no
checking for struct timespec in <time.h>... yes
checking for wint_t... yes
checking for size_t... yes
checking for inttypes.h... yes
checking for stdint.h... yes
checking for intmax_t... yes
checking whether snprintf returns a byte count as in C99... yes
checking for snprintf... yes
checking for strnlen... yes
checking for wcslen... yes
checking for wcsnlen... yes
checking for mbrtowc... (cached) yes
checking for wcrtomb... (cached) yes
checking whether _snprintf is declared... no
checking whether <wchar.h> uses 'inline' correctly... yes
checking for a traditional french locale... none
checking whether ungetc works on arbitrary bytes... yes
checking type of array argument to getgroups... gid_t
checking for getgroups... yes
checking for working getgroups... yes
checking for off_t... yes
checking for inttypes.h... (cached) yes
checking whether the inttypes.h PRIxNN macros are broken... no
checking for LC_MESSAGES... yes
checking for CFPreferencesCopyAppValue... no
checking for CFLocaleCopyCurrent... no
checking whether alarm is declared... yes
checking whether snprintf is declared... yes
checking whether unsetenv is declared... yes
checking for alloca as a compiler built-in... yes
checking whether inet_ntop is declared without a macro... yes
checking whether inet_pton is declared without a macro... yes
checking whether this system has an arbitrary file name length limit... yes
checking for d_ino member in directory struct... yes
checking for d_type member in directory struct... yes
checking whether alphasort is declared without a macro... yes
checking whether dirfd is declared without a macro... yes
checking whether fdopendir is declared without a macro... yes
checking whether scandir is declared without a macro... yes
checking for dirfd... yes
checking whether dirfd is declared... (cached) yes
checking whether dirfd is a macro... no
checking whether // is distinct from /... (cached) no
checking whether dup2 works... yes
checking for error_at_line... yes
checking whether fflush works on input streams... no
checking whether fcntl handles F_DUPFD correctly... yes
checking whether fcntl understands F_DUPFD_CLOEXEC... needs runtime check
checking whether fcntl is declared without a macro... yes
checking whether openat is declared without a macro... yes
checking whether fdopendir is declared... (cached) yes
checking whether fdopendir works... yes
checking whether fflush works on input streams... (cached) no
checking whether __fpending is declared... yes
checking whether fpurge is declared... no
checking whether fflush works on input streams... (cached) no
checking for ftello... yes
checking whether ftello works... yes
checking for fchmodat... yes
checking for fstatat... yes
checking for mkdirat... yes
checking for openat... yes
checking for unlinkat... yes
checking for fchownat... yes
checking whether fchownat works with AT_SYMLINK_NOFOLLOW... yes
checking whether fchownat works with an empty file name... yes
checking for struct statfs.f_type... yes
checking whether the compiler generally respects inline... yes
checking for lchown... yes
checking for pthread_rwlock_t... yes
checking whether lseek detects pipes... yes
checking whether mbrtowc handles incomplete characters... guessing yes
checking whether mbrtowc works as well as mbtowc... guessing yes
checking whether mbrtowc handles a NULL pwc argument... guessing yes
checking whether mbrtowc handles a NULL string argument... guessing yes
checking whether mbrtowc has a correct return value... guessing yes
checking whether mbrtowc returns 0 when parsing a NUL character... guessing yes
checking whether mbrtowc handles incomplete characters... (cached) guessing yes
checking whether mbrtowc works as well as mbtowc... (cached) guessing yes
checking for mempcpy... (cached) yes
checking for memrchr... yes
checking whether mkdir handles trailing slash... yes
checking whether mkdir handles trailing dot... yes
checking whether <netinet/in.h> is self-contained... yes
checking whether open recognizes a trailing slash... yes
checking for fchmodat... (cached) yes
checking for fstatat... (cached) yes
checking for mkdirat... (cached) yes
checking for openat... (cached) yes
checking for unlinkat... (cached) yes
checking for fchownat... (cached) yes
checking whether fchownat works with AT_SYMLINK_NOFOLLOW... (cached) yes
checking whether fchownat works with an empty file name... (cached) yes
checking whether program_invocation_name is declared... yes
checking whether program_invocation_short_name is declared... yes
checking for rawmemchr... yes
checking whether rmdir works... yes
checking whether setenv validates arguments... yes
checking for stdint.h... (cached) yes
checking for SIZE_MAX... yes
checking for socklen_t... yes
checking for ssize_t... (cached) yes
checking whether stat handles trailing slashes on directories... yes
checking whether stat handles trailing slashes on files... yes
checking for va_copy... yes
checking whether NULL can be used in arbitrary expressions... yes
checking whether dprintf is declared without a macro... yes
checking whether fpurge is declared without a macro... no
checking whether fseeko is declared without a macro... yes
checking whether ftello is declared without a macro... yes
checking whether getdelim is declared without a macro... yes
checking whether getline is declared without a macro... yes
checking whether popen is declared without a macro... yes
checking whether renameat is declared without a macro... yes
checking whether snprintf is declared without a macro... yes
checking whether tmpfile is declared without a macro... yes
checking whether vdprintf is declared without a macro... yes
checking whether vsnprintf is declared without a macro... yes
checking whether _Exit is declared without a macro... yes
checking whether atoll is declared without a macro... yes
checking whether canonicalize_file_name is declared without a macro... yes
checking whether getloadavg is declared without a macro... yes
checking whether getsubopt is declared without a macro... yes
checking whether grantpt is declared without a macro... yes
checking whether mkdtemp is declared without a macro... yes
checking whether mkostemp is declared without a macro... yes
checking whether mkostemps is declared without a macro... yes
checking whether mkstemp is declared without a macro... yes
checking whether mkstemps is declared without a macro... yes
checking whether ptsname is declared without a macro... yes
checking whether random_r is declared without a macro... yes
checking whether initstat_r is declared without a macro... no
checking whether srandom_r is declared without a macro... yes
checking whether setstate_r is declared without a macro... yes
checking whether realpath is declared without a macro... yes
checking whether rpmatch is declared without a macro... yes
checking whether setenv is declared without a macro... yes
checking whether strtod is declared without a macro... yes
checking whether strtoll is declared without a macro... yes
checking whether strtoull is declared without a macro... yes
checking whether unlockpt is declared without a macro... yes
checking whether unsetenv is declared without a macro... yes
checking for strchrnul... yes
checking whether strchrnul works... yes
checking for working strerror function... yes
checking for working strndup... yes
checking for working strnlen... yes
checking for strtoll... yes
checking for strtoull... yes
checking whether <sys/socket.h> is self-contained... yes
checking for shutdown... (cached) yes
checking whether <sys/socket.h> defines the SHUT_* macros... yes
checking for struct sockaddr_storage... yes
checking for sa_family_t... yes
checking for struct sockaddr_storage.ss_family... yes
checking whether socket is declared without a macro... yes
checking whether connect is declared without a macro... yes
checking whether accept is declared without a macro... yes
checking whether bind is declared without a macro... yes
checking whether getpeername is declared without a macro... yes
checking whether getsockname is declared without a macro... yes
checking whether getsockopt is declared without a macro... yes
checking whether listen is declared without a macro... yes
checking whether recv is declared without a macro... yes
checking whether send is declared without a macro... yes
checking whether recvfrom is declared without a macro... yes
checking whether sendto is declared without a macro... yes
checking whether setsockopt is declared without a macro... yes
checking whether shutdown is declared without a macro... yes
checking whether accept4 is declared without a macro... yes
checking for nlink_t... yes
checking whether fchmodat is declared without a macro... yes
checking whether fstatat is declared without a macro... yes
checking whether futimens is declared without a macro... yes
checking whether lchmod is declared without a macro... yes
checking whether lstat is declared without a macro... yes
checking whether mkdirat is declared without a macro... yes
checking whether mkfifo is declared without a macro... yes
checking whether mkfifoat is declared without a macro... yes
checking whether mknod is declared without a macro... yes
checking whether mknodat is declared without a macro... yes
checking whether stat is declared without a macro... yes
checking whether utimensat is declared without a macro... yes
checking whether chown is declared without a macro... yes
checking whether dup2 is declared without a macro... yes
checking whether dup3 is declared without a macro... yes
checking whether environ is declared without a macro... yes
checking whether euidaccess is declared without a macro... yes
checking whether faccessat is declared without a macro... yes
checking whether fchdir is declared without a macro... yes
checking whether fchownat is declared without a macro... yes
checking whether fsync is declared without a macro... yes
checking whether ftruncate is declared without a macro... yes
checking whether getcwd is declared without a macro... yes
checking whether getdomainname is declared without a macro... yes
checking whether getdtablesize is declared without a macro... yes
checking whether getgroups is declared without a macro... yes
checking whether gethostname is declared without a macro... yes
checking whether getlogin is declared without a macro... yes
checking whether getlogin_r is declared without a macro... yes
checking whether getpagesize is declared without a macro... yes
checking whether getusershell is declared without a macro... yes
checking whether setusershell is declared without a macro... yes
checking whether endusershell is declared without a macro... yes
checking whether group_member is declared without a macro... yes
checking whether lchown is declared without a macro... yes
checking whether link is declared without a macro... yes
checking whether linkat is declared without a macro... yes
checking whether lseek is declared without a macro... yes
checking whether pipe is declared without a macro... yes
checking whether pipe2 is declared without a macro... yes
checking whether pread is declared without a macro... yes
checking whether pwrite is declared without a macro... yes
checking whether readlink is declared without a macro... yes
checking whether readlinkat is declared without a macro... yes
checking whether rmdir is declared without a macro... yes
checking whether sleep is declared without a macro... yes
checking whether symlink is declared without a macro... yes
checking whether symlinkat is declared without a macro... yes
checking whether ttyname_r is declared without a macro... yes
checking whether unlink is declared without a macro... yes
checking whether unlinkat is declared without a macro... yes
checking whether usleep is declared without a macro... yes
checking whether unlink honors trailing slashes... (cached) yes
checking whether unlink of a parent directory fails as it should... (cached) guessing yes
checking for ptrdiff_t... yes
checking for vasprintf... yes
checking whether btowc is declared without a macro... yes
checking whether wctob is declared without a macro... yes
checking whether mbsinit is declared without a macro... yes
checking whether mbrtowc is declared without a macro... yes
checking whether mbrlen is declared without a macro... yes
checking whether mbsrtowcs is declared without a macro... yes
checking whether mbsnrtowcs is declared without a macro... yes
checking whether wcrtomb is declared without a macro... yes
checking whether wcsrtombs is declared without a macro... yes
checking whether wcsnrtombs is declared without a macro... yes
checking whether wcwidth is declared without a macro... yes
checking whether wmemchr is declared without a macro... yes
checking whether wmemcmp is declared without a macro... yes
checking whether wmemcpy is declared without a macro... yes
checking whether wmemmove is declared without a macro... yes
checking whether wmemset is declared without a macro... yes
checking whether wcslen is declared without a macro... yes
checking whether wcsnlen is declared without a macro... yes
checking whether wcscpy is declared without a macro... yes
checking whether wcpcpy is declared without a macro... yes
checking whether wcsncpy is declared without a macro... yes
checking whether wcpncpy is declared without a macro... yes
checking whether wcscat is declared without a macro... yes
checking whether wcsncat is declared without a macro... yes
checking whether wcscmp is declared without a macro... yes
checking whether wcsncmp is declared without a macro... yes
checking whether wcscasecmp is declared without a macro... yes
checking whether wcsncasecmp is declared without a macro... yes
checking whether wcscoll is declared without a macro... yes
checking whether wcsxfrm is declared without a macro... yes
checking whether wcsdup is declared without a macro... yes
checking whether wcschr is declared without a macro... yes
checking whether wcsrchr is declared without a macro... yes
checking whether wcscspn is declared without a macro... yes
checking whether wcsspn is declared without a macro... yes
checking whether wcspbrk is declared without a macro... yes
checking whether wcsstr is declared without a macro... yes
checking whether wcstok is declared without a macro... yes
checking whether wcswidth is declared without a macro... yes
checking whether iswcntrl works... yes
checking for wctype_t... yes
checking for wctrans_t... yes
checking whether wctype is declared without a macro... yes
checking whether iswctype is declared without a macro... yes
checking whether wctrans is declared without a macro... yes
checking whether towctrans is declared without a macro... yes
checking for stdint.h... (cached) yes
checking for long long int... (cached) yes
checking whether btowc(0) is correct... yes
checking whether btowc(EOF) is correct... guessing yes
checking for a traditional french locale... (cached) none
checking for a french Unicode locale... (cached) none
checking whether getgroups handles negative values... yes
checking for getpagesize... yes
checking whether getpagesize is declared... (cached) yes
checking whether INT32_MAX < INTMAX_MAX... yes
checking whether INT64_MAX == LONG_MAX... yes
checking whether UINT32_MAX < UINTMAX_MAX... yes
checking whether UINT64_MAX == ULONG_MAX... yes
checking whether locale.h conforms to POSIX:2001... yes
checking whether locale.h defines locale_t... yes
checking whether setlocale is declared without a macro... yes
checking whether duplocale is declared without a macro... yes
checking for setlocale... yes
checking for uselocale... yes
checking for a traditional french locale... (cached) none
checking for a french Unicode locale... (cached) none
checking for a traditional japanese locale... (cached) none
checking for a transitional chinese locale... (cached) none
checking for a french Unicode locale... (cached) none
checking for mmap... (cached) yes
checking for MAP_ANONYMOUS... yes
checking for mmap... (cached) yes
checking for MAP_ANONYMOUS... yes
checking for getppriv... no
checking for putenv compatible with GNU and SVID... yes
checking for mmap... (cached) yes
checking for MAP_ANONYMOUS... yes
checking for stdlib.h... (cached) yes
checking for GNU libc compatible realloc... yes
checking for a traditional french locale... (cached) none
checking for a french Unicode locale... (cached) none
checking for a traditional japanese locale... (cached) none
checking for a transitional chinese locale... (cached) none
checking whether sleep is declared... (cached) yes
checking for working sleep... yes
checking for snprintf... (cached) yes
checking whether snprintf respects a size of 1... yes
checking for struct stat.st_atim.tv_nsec... yes
checking whether struct stat.st_atim is of type struct timespec... yes
checking for struct stat.st_birthtimespec.tv_nsec... no
checking for struct stat.st_birthtimensec... no
checking for struct stat.st_birthtim.tv_nsec... no
checking for wchar_t... (cached) yes
checking for wint_t... (cached) yes
checking for mmap... (cached) yes
checking for MAP_ANONYMOUS... yes
checking whether symlink handles trailing slash correctly... yes
checking for pthread_atfork... yes
checking for unsetenv... yes
checking for unsetenv() return type... int
checking whether unsetenv obeys POSIX... yes
checking for useconds_t... yes
checking whether usleep allows large arguments... yes
checking whether mbrtowc handles incomplete characters... (cached) guessing yes
checking whether mbrtowc works as well as mbtowc... (cached) guessing yes
checking whether wcrtomb return value is correct... guessing yes
checking for a traditional french locale... (cached) none
checking for a french Unicode locale... (cached) none
checking for a traditional japanese locale... (cached) none
checking for a transitional chinese locale... (cached) none
checking whether wctob works... guessing yes
checking whether wctob is declared... (cached) yes
checking for sched_yield in -lrt... yes
checking for a sed that does not truncate output... /bin/sed
checking for fgrep... /bin/grep -F
checking for ld used by gcc -std=gnu99... /usr/bin/ld
checking if the linker (/usr/bin/ld) is GNU ld... yes
checking for BSD- or MS-compatible name lister (nm)... /usr/bin/nm -B
checking the name lister (/usr/bin/nm -B) interface... BSD nm
checking whether ln -s works... yes
checking the maximum length of command line arguments... 1572864
checking whether the shell understands some XSI constructs... yes
checking whether the shell understands "+="... yes
checking for /usr/bin/ld option to reload object files... -r
checking for objdump... objdump
checking how to recognize dependent libraries... pass_all
checking for ar... ar
checking for strip... strip
checking for ranlib... (cached) ranlib
checking command to parse /usr/bin/nm -B output from gcc -std=gnu99 object... ok
checking for dlfcn.h... yes
checking for objdir... .libs
checking if gcc -std=gnu99 supports -fno-rtti -fno-exceptions... no
checking for gcc -std=gnu99 option to produce PIC... -fPIC -DPIC
checking if gcc -std=gnu99 PIC flag -fPIC -DPIC works... yes
checking if gcc -std=gnu99 static flag -static works... yes
checking if gcc -std=gnu99 supports -c -o file.o... yes
checking if gcc -std=gnu99 supports -c -o file.o... (cached) yes
checking whether the gcc -std=gnu99 linker (/usr/bin/ld -m elf_x86_64) supports shared libraries... yes
checking whether -lc should be explicitly linked in... no
checking dynamic linker characteristics... GNU/Linux ld.so
checking how to hardcode library paths into programs... immediate
checking whether stripping libraries is possible... yes
checking if libtool supports shared libraries... yes
checking whether to build shared libraries... yes
checking whether to build static libraries... yes
checking for gcc -std=gnu99 option to accept ISO C99... (cached) -std=gnu99
checking for gcc -std=gnu99 -std=gnu99 option to accept ISO Standard C... (cached) -std=gnu99
checking how to run the C preprocessor... gcc -E
checking whether compiler handles -Werror... yes
checking whether -Wno-missing-field-initializers is supported... yes
checking whether -Wno-missing-field-initializers is needed... yes
checking whether compiler handles -Wall... yes
checking whether compiler handles -W... yes
checking whether compiler handles -Wformat-y2k... yes
checking whether compiler handles -Wformat-nonliteral... yes
checking whether compiler handles -Wformat-security... yes
checking whether compiler handles -Winit-self... yes
checking whether compiler handles -Wmissing-include-dirs... yes
checking whether compiler handles -Wswitch-default... yes
checking whether compiler handles -Wswitch-enum... yes
checking whether compiler handles -Wunused... yes
checking whether compiler handles -Wunknown-pragmas... yes
checking whether compiler handles -Wstrict-aliasing... yes
checking whether compiler handles -Wstrict-overflow... yes
checking whether compiler handles -Wfloat-equal... yes
checking whether compiler handles -Wpointer-arith... yes
checking whether compiler handles -Wbad-function-cast... yes
checking whether compiler handles -Wcast-align... yes
checking whether compiler handles -Wwrite-strings... yes
checking whether compiler handles -Wstrict-prototypes... yes
checking whether compiler handles -Wold-style-definition... yes
checking whether compiler handles -Wmissing-prototypes... yes
checking whether compiler handles -Wmissing-declarations... yes
checking whether compiler handles -Wmissing-noreturn... yes
checking whether compiler handles -Wnested-externs... yes
checking whether compiler handles -Winvalid-pch... yes
checking whether compiler handles -Wvolatile-register-var... yes
checking whether compiler handles -Wdisabled-optimization... yes
checking whether compiler handles -Woverlength-strings... yes
checking whether compiler handles -Wbuiltin-macro-redefined... yes
checking whether compiler handles -Wmudflap... yes
checking whether compiler handles -Wpacked-bitfield-compat... yes
checking whether compiler handles -Wsync-nand... yes
checking whether compiler handles -Wattributes... yes
checking whether compiler handles -Wcoverage-mismatch... yes
checking whether compiler handles -Wmultichar... yes
checking whether compiler handles -Wunused-macros... yes
checking whether compiler handles -Wno-missing-field-initializers... yes
checking whether compiler handles -Wno-unused-parameter... yes
checking whether compiler handles -Wno-jump-misses-init... yes
checking whether compiler handles -Wno-unused-variable... yes
checking whether compiler handles -Wno-logical-op... yes
checking whether compiler handles -Wno-strict-overflow... yes
checking whether compiler handles -fdiagnostics-show-option... yes
checking for function prototypes... yes
checking for special C compiler options needed for large files... no
checking for _FILE_OFFSET_BITS value needed for large files... no
checking size of long... 8
checking errno.h usability... yes
checking errno.h presence... yes
checking for errno.h... yes
checking for sys/types.h... (cached) yes
checking sys/un.h usability... yes
checking sys/un.h presence... yes
checking for sys/un.h... yes
checking sys/wait.h usability... yes
checking sys/wait.h presence... yes
checking for sys/wait.h... yes
checking for sys/socket.h... (cached) yes
checking endian.h usability... yes
checking endian.h presence... yes
checking for endian.h... yes
checking byteswap.h usability... yes
checking byteswap.h presence... yes
checking for byteswap.h... yes
checking for futimens... yes
checking for posix_fallocate... yes
checking if we should build the daemon... yes
checking if we should build the appliance... yes
checking for febootstrap... febootstrap
checking if user requested febootstrap --yum-config option... no
checking which Linux distro for package names... DEBIAN
checking for rpcgen... rpcgen
checking for xdrmem_create in -lportablexdr... no
checking for library containing xdrmem_create... none required
checking for cpio... cpio
checking for gperf... gperf
checking for pod2man... pod2man
checking for pod2text... pod2text
checking for pod2html... pod2html
checking if pod2man takes --stderr option... yes
checking if pod2man takes -u option... yes
checking for genisoimage... /usr/bin/genisoimage
checking for xmllint... xmllint
checking for po4a... po4a
checking for db_dump... no
checking for db4_dump... no
checking for db4.8_dump... db4.8_dump
checking for db_load... no
checking for db4_load... no
checking for db4.8_load... db4.8_load
checking for qemu-kvm... no
checking for kvm... no
checking for qemu-system-x86_64... /usr/bin/qemu-system-x86_64
checking for virtio-serial support in /usr/bin/qemu-system-x86_64... yes
checking for main in -lreadline... yes
checking for append_history... yes
checking for completion_matches... yes
checking for rl_completion_matches... yes
checking whether NLS is requested... yes
checking for msgfmt... /usr/bin/msgfmt
checking for gmsgfmt... /usr/bin/msgfmt
checking for xgettext... /usr/bin/xgettext
checking for msgmerge... /usr/bin/msgmerge
checking for CFPreferencesCopyAppValue... (cached) no
checking for CFLocaleCopyCurrent... (cached) no
checking for GNU gettext in libc... yes
checking whether to use NLS... yes
checking where the gettext function comes from... libc
checking for magic_file in -lmagic... yes
checking magic.h usability... yes
checking magic.h presence... yes
checking for magic.h... yes
checking for pkg-config... /usr/bin/pkg-config
checking pkg-config is at least version 0.9.0... yes
checking for PCRE... yes
checking for LIBVIRT... yes
checking for LIBXML2... yes
checking for LIBCONFIG... no
configure: WARNING: libconfig not found, some features will be disabled
checking for HIVEX... yes
checking for FUSE... yes
checking for ocamlc... ocamlc
OCaml version is 3.12.0
OCaml library path is /usr/lib/ocaml
checking for ocamlopt... ocamlopt
checking for ocamlc.opt... ocamlc.opt
checking for ocamlopt.opt... ocamlopt.opt
checking for ocamldep... ocamldep
checking for ocamlmktop... ocamlmktop
checking for ocamlmklib... ocamlmklib
checking for ocamldoc... ocamldoc
checking for ocamlbuild... ocamlbuild
checking for ocamlfind... ocamlfind
checking for OCaml findlib package pcre... found
checking for perl... perl
checking for Test::More... yes
checking for ExtUtils::MakeMaker... yes
checking for python... python
checking Python prefix... /usr
checking Python version... 2.6
checking for Python include path... /usr/include/python2.6
checking for Python site-packages path... /usr/lib/python2.6/dist-packages
checking for PyCapsule_New... no
checking for ruby_init in -lruby... no
checking for rake... no
checking for JDK in /usr/lib/jvm/java-6-openjdk... found java version "1.6.0_18" in /usr/lib/jvm/java-6-openjdk
checking for jni.h... -I/usr/lib/jvm/java-6-openjdk/include
checking for jni_md.h... -I/usr/lib/jvm/java-6-openjdk/include -I/usr/lib/jvm/java-6-openjdk/include/linux
checking extra javac flags... 
checking for ghc... no
checking for php... no
checking for phpize... no
checking for Pod::Usage... yes
checking for Getopt::Long... yes
checking for Sys::Virt... yes
checking for Data::Dumper... yes
checking for Locale::TextDomain... yes
checking for Win::Hivex... yes
checking for Win::Hivex::Regedit... yes
checking for String::ShellQuote... yes
configure: creating ./config.status
config.status: creating podwrapper.sh
config.status: creating Makefile
config.status: creating appliance/Makefile
config.status: creating capitests/Makefile
config.status: creating cat/Makefile
config.status: creating caution/Makefile
config.status: creating csharp/Makefile
config.status: creating debian/changelog
config.status: creating df/Makefile
config.status: creating edit/Makefile
config.status: creating examples/Makefile
config.status: creating fish/Makefile
config.status: creating fuse/Makefile
config.status: creating generator/Makefile
config.status: creating gnulib/lib/Makefile
config.status: creating gnulib/tests/Makefile
config.status: creating haskell/Makefile
config.status: creating images/Makefile
config.status: creating inspector/Makefile
config.status: creating java/Makefile
config.status: creating libguestfs.pc
config.status: creating ocaml/META
config.status: creating ocaml/Makefile
config.status: creating ocaml/examples/Makefile
config.status: creating perl/Makefile
config.status: creating perl/Makefile.PL
config.status: creating perl/examples/Makefile
config.status: creating php/Makefile
config.status: creating po-docs/Makefile
config.status: creating po-docs/ja/Makefile
config.status: creating po-docs/uk/Makefile
config.status: creating po/Makefile.in
config.status: creating python/Makefile
config.status: creating python/examples/Makefile
config.status: creating regressions/Makefile
config.status: creating rescue/Makefile
config.status: creating resize/Makefile
config.status: creating ruby/Makefile
config.status: creating ruby/Rakefile
config.status: creating ruby/examples/Makefile
config.status: creating src/Makefile
config.status: creating test-tool/Makefile
config.status: creating tools/Makefile
config.status: creating config.h
config.status: executing depfiles commands
config.status: executing libtool commands
config.status: executing po-directories commands
config.status: creating po/POTFILES
config.status: creating po/Makefile
=== configuring in daemon (/home/rjones/d/libguestfs/daemon)
configure: running /bin/sh ./configure --disable-option-checking '--prefix=/usr/local'  '--enable-gcc-warnings' --cache-file=/dev/null --srcdir=.
checking for a BSD-compatible install... /usr/bin/install -c
checking whether build environment is sane... yes
checking for a thread-safe mkdir -p... /bin/mkdir -p
checking for gawk... gawk
checking whether make sets $(MAKE)... yes
checking if we should install the daemon... no
checking build system type... x86_64-unknown-linux-gnu
checking host system type... x86_64-unknown-linux-gnu
checking for style of include used by make... GNU
checking for gcc... gcc
checking whether the C compiler works... yes
checking for C compiler default output file name... a.out
checking for suffix of executables... 
checking whether we are cross compiling... no
checking for suffix of object files... o
checking whether we are using the GNU C compiler... yes
checking whether gcc accepts -g... yes
checking for gcc option to accept ISO C89... none needed
checking dependency style of gcc... gcc3
checking how to run the C preprocessor... gcc -E
checking for grep that handles long lines and -e... /bin/grep
checking for egrep... /bin/grep -E
checking for ANSI C header files... yes
checking for sys/types.h... yes
checking for sys/stat.h... yes
checking for stdlib.h... yes
checking for string.h... yes
checking for memory.h... yes
checking for strings.h... yes
checking for inttypes.h... yes
checking for stdint.h... yes
checking for unistd.h... yes
checking minix/config.h usability... no
checking minix/config.h presence... no
checking for minix/config.h... no
checking whether it is safe to define __EXTENSIONS__... yes
checking for gcc... (cached) gcc
checking whether we are using the GNU C compiler... (cached) yes
checking whether gcc accepts -g... (cached) yes
checking for gcc option to accept ISO C89... (cached) none needed
checking dependency style of gcc... (cached) gcc3
checking how to run the C preprocessor... gcc -E
checking for ranlib... ranlib
checking whether gcc and cc understand -c and -o together... yes
checking for _LARGEFILE_SOURCE value needed for large files... no
checking for working alloca.h... yes
checking for alloca... yes
checking arpa/inet.h usability... yes
checking arpa/inet.h presence... yes
checking for arpa/inet.h... yes
checking features.h usability... yes
checking features.h presence... yes
checking for features.h... yes
checking sys/socket.h usability... yes
checking sys/socket.h presence... yes
checking for sys/socket.h... yes
checking dirent.h usability... yes
checking dirent.h presence... yes
checking for dirent.h... yes
checking wctype.h usability... yes
checking wctype.h presence... yes
checking for wctype.h... yes
checking sys/param.h usability... yes
checking sys/param.h presence... yes
checking for sys/param.h... yes
checking sys/vfs.h usability... yes
checking sys/vfs.h presence... yes
checking for sys/vfs.h... yes
checking sys/fs_types.h usability... no
checking sys/fs_types.h presence... no
checking for sys/fs_types.h... no
checking netdb.h usability... yes
checking netdb.h presence... yes
checking for netdb.h... yes
checking netinet/in.h usability... yes
checking netinet/in.h presence... yes
checking for netinet/in.h... yes
checking sys/time.h usability... yes
checking sys/time.h presence... yes
checking for sys/time.h... yes
checking sys/cdefs.h usability... yes
checking sys/cdefs.h presence... yes
checking for sys/cdefs.h... yes
checking for unistd.h... (cached) yes
checking sys/mman.h usability... yes
checking sys/mman.h presence... yes
checking for sys/mman.h... yes
checking sys/select.h usability... yes
checking sys/select.h presence... yes
checking for sys/select.h... yes
checking wchar.h usability... yes
checking wchar.h presence... yes
checking for wchar.h... yes
checking for stdint.h... (cached) yes
checking for sys/stat.h... (cached) yes
checking sys/uio.h usability... yes
checking sys/uio.h presence... yes
checking for sys/uio.h... yes
checking sys/wait.h usability... yes
checking sys/wait.h presence... yes
checking for sys/wait.h... yes
checking utime.h usability... yes
checking utime.h presence... yes
checking for utime.h... yes
checking grp.h usability... yes
checking grp.h presence... yes
checking for grp.h... yes
checking for inttypes.h... (cached) yes
checking xlocale.h usability... yes
checking xlocale.h presence... yes
checking for xlocale.h... yes
checking priv.h usability... no
checking priv.h presence... no
checking for priv.h... no
checking sys/ioctl.h usability... yes
checking sys/ioctl.h presence... yes
checking for sys/ioctl.h... yes
checking whether the preprocessor supports include_next... yes
checking whether system header files limit the line length... no
checking for inline... inline
checking for uid_t in sys/types.h... yes
checking for unistd.h... (cached) yes
checking for working chown... yes
checking whether chown dereferences symlinks... yes
checking for chown... yes
checking for fchown... yes
checking for fcntl... yes
checking for dup2... yes
checking for fchdir... yes
checking for fdopendir... yes
checking for mempcpy... yes
checking for btowc... yes
checking for isblank... yes
checking for iswctype... yes
checking for mbsrtowcs... yes
checking for wmemchr... yes
checking for wmemcpy... yes
checking for wmempcpy... yes
checking for fpurge... no
checking for __fpurge... yes
checking for __freading... yes
checking for futimens... yes
checking for getdelim... yes
checking for getdtablesize... yes
checking for getlogin_r... yes
checking for gettimeofday... yes
checking for nanotime... no
checking for fstatat... yes
checking for getpwnam_r... yes
checking for lchmod... no
checking for lstat... yes
checking for mbsinit... yes
checking for mbrtowc... yes
checking for mprotect... yes
checking for pread... yes
checking for readlink... yes
checking for sleep... yes
checking for strdup... yes
checking for catgets... yes
checking for strndup... yes
checking for symlink... yes
checking for symlinkat... yes
checking for pipe... yes
checking for futimes... yes
checking for futimesat... yes
checking for utimensat... yes
checking for lutimes... yes
checking for vasnprintf... no
checking for iswcntrl... yes
checking for getegid... yes
checking for newlocale... yes
checking for getgrouplist... yes
checking for pathconf... yes
checking for setenv... yes
checking for shutdown... yes
checking for usleep... yes
checking for wcrtomb... yes
checking for wctob... yes
checking whether chown honors trailing slash... yes
checking whether chown always updates ctime... yes
checking whether <sys/socket.h> is self-contained... yes
checking for shutdown... (cached) yes
checking whether <sys/socket.h> defines the SHUT_* macros... yes
checking for struct sockaddr_storage... yes
checking for sa_family_t... yes
checking for struct sockaddr_storage.ss_family... yes
checking whether socket is declared without a macro... yes
checking whether connect is declared without a macro... yes
checking whether accept is declared without a macro... yes
checking whether bind is declared without a macro... yes
checking whether getpeername is declared without a macro... yes
checking whether getsockname is declared without a macro... yes
checking whether getsockopt is declared without a macro... yes
checking whether listen is declared without a macro... yes
checking whether recv is declared without a macro... yes
checking whether send is declared without a macro... yes
checking whether recvfrom is declared without a macro... yes
checking whether sendto is declared without a macro... yes
checking whether setsockopt is declared without a macro... yes
checking whether shutdown is declared without a macro... yes
checking whether accept4 is declared without a macro... yes
checking whether // is distinct from /... no
checking for complete errno.h... yes
checking whether strerror_r is declared... yes
checking for strerror_r... yes
checking whether strerror_r returns char *... yes
checking whether fchdir is declared... yes
checking for mode_t... yes
checking for promoted mode_t type... mode_t
checking for working fcntl.h... yes
checking for mbstate_t... yes
checking for fseeko... yes
checking whether stdin defaults to large file offsets... yes
checking whether fseeko is declared... yes
checking whether ftello is declared... yes
checking whether getaddrinfo is declared without a macro... yes
checking whether freeaddrinfo is declared without a macro... yes
checking whether gai_strerror is declared without a macro... yes
checking whether getnameinfo is declared without a macro... yes
checking for library containing gethostbyname... none required
checking for gethostbyname... yes
checking for library containing getservbyname... none required
checking for getservbyname... yes
checking for IPv4 sockets... yes
checking for IPv6 sockets... yes
checking for C/C++ restrict keyword... __restrict
checking for library containing inet_ntop... none required
checking whether inet_ntop is declared... yes
checking whether getcwd (NULL, 0) allocates memory for result... yes
checking whether getdelim is declared... yes
checking whether getline is declared... yes
checking whether getlogin_r is declared... yes
checking whether getlogin is declared... yes
checking for struct timeval... yes
checking whether gettimeofday is declared without a macro... yes
checking for nl_langinfo and CODESET... yes
checking whether getc_unlocked is declared... yes
checking whether we are using the GNU C Library >= 2.1 or uClibc... yes
checking for ld used by GCC... /usr/bin/ld
checking if the linker (/usr/bin/ld) is GNU ld... yes
checking for shared library run path origin... done
checking whether imported symbols can be declared weak... yes
checking pthread.h usability... yes
checking pthread.h presence... yes
checking for pthread.h... yes
checking for pthread_kill in -lpthread... yes
checking for multithread API to use... posix
checking whether lstat correctly handles trailing slash... yes
checking whether malloc, realloc, calloc are POSIX compliant... yes
checking for a traditional japanese locale... none
checking for a transitional chinese locale... none
checking for a french Unicode locale... none
checking for a traditional french locale... none
checking for mmap... yes
checking for MAP_ANONYMOUS... yes
checking whether memchr works... yes
checking whether memrchr is declared... yes
checking whether unlink honors trailing slashes... yes
checking whether unlink of a parent directory fails as it should... guessing yes
checking whether strerror_r is declared... (cached) yes
checking for strerror_r... (cached) yes
checking for strerror_r with POSIX signature... no
checking for __xpg_strerror_r... yes
checking for ssize_t... yes
checking whether <sys/select.h> is self-contained... yes
checking whether select is declared without a macro... yes
checking for library containing setsockopt... none needed
checking whether snprintf returns a byte count as in C99... yes
checking whether snprintf is declared... yes
checking for stdbool.h that conforms to C99... yes
checking for _Bool... yes
checking for wchar_t... yes
checking for unsigned long long int... yes
checking for long long int... yes
checking whether stdint.h conforms to C99... yes
checking whether strdup is declared... yes
checking whether memmem is declared without a macro... yes
checking whether mempcpy is declared without a macro... yes
checking whether memrchr is declared without a macro... yes
checking whether rawmemchr is declared without a macro... yes
checking whether stpcpy is declared without a macro... yes
checking whether stpncpy is declared without a macro... yes
checking whether strchrnul is declared without a macro... yes
checking whether strdup is declared without a macro... yes
checking whether strncat is declared without a macro... yes
checking whether strndup is declared without a macro... yes
checking whether strnlen is declared without a macro... yes
checking whether strpbrk is declared without a macro... yes
checking whether strsep is declared without a macro... yes
checking whether strcasestr is declared without a macro... yes
checking whether strtok_r is declared without a macro... yes
checking whether strerror_r is declared without a macro... yes
checking whether strsignal is declared without a macro... yes
checking whether strverscmp is declared without a macro... yes
checking whether strndup is declared... (cached) yes
checking whether strnlen is declared... (cached) yes
checking whether stat file-mode macros are broken... no
checking for special C compiler options needed for large files... no
checking for _FILE_OFFSET_BITS value needed for large files... no
checking for struct timespec in <time.h>... yes
checking whether the utimes function works... yes
checking for struct utimbuf... yes
checking for wint_t... yes
checking for size_t... yes
checking for inttypes.h... yes
checking for stdint.h... yes
checking for intmax_t... yes
checking for snprintf... yes
checking for strnlen... yes
checking for wcslen... yes
checking for wcsnlen... yes
checking for mbrtowc... (cached) yes
checking for wcrtomb... (cached) yes
checking whether _snprintf is declared... no
checking whether <wchar.h> uses 'inline' correctly... yes
checking if environ is properly declared... yes
checking whether ungetc works on arbitrary bytes... yes
checking type of array argument to getgroups... gid_t
checking for getgroups... yes
checking for working getgroups... yes
checking for off_t... yes
checking whether imaxabs is declared without a macro... yes
checking whether imaxdiv is declared without a macro... yes
checking whether strtoimax is declared without a macro... yes
checking whether strtoumax is declared without a macro... yes
checking for inttypes.h... (cached) yes
checking whether the inttypes.h PRIxNN macros are broken... no
checking for LC_MESSAGES... yes
checking for CFPreferencesCopyAppValue... no
checking for CFLocaleCopyCurrent... no
checking for stdlib.h... (cached) yes
checking for GNU libc compatible malloc... yes
checking whether setenv is declared... yes
checking search.h usability... yes
checking search.h presence... yes
checking for search.h... yes
checking for tsearch... yes
checking whether alarm is declared... yes
checking whether unsetenv is declared... yes
checking for alloca as a compiler built-in... yes
checking whether inet_ntop is declared without a macro... yes
checking whether inet_pton is declared without a macro... yes
checking byteswap.h usability... yes
checking byteswap.h presence... yes
checking for byteswap.h... yes
checking whether this system has an arbitrary file name length limit... yes
checking for library containing clock_gettime... -lrt
checking for clock_gettime... yes
checking for clock_settime... yes
checking for d_type member in directory struct... yes
checking whether alphasort is declared without a macro... yes
checking whether dirfd is declared without a macro... yes
checking whether fdopendir is declared without a macro... yes
checking whether scandir is declared without a macro... yes
checking for dirfd... yes
checking whether dirfd is declared... (cached) yes
checking whether dirfd is a macro... no
checking whether // is distinct from /... (cached) no
checking whether dup2 works... yes
checking for error_at_line... yes
checking whether fflush works on input streams... no
checking whether fcntl handles F_DUPFD correctly... yes
checking whether fcntl understands F_DUPFD_CLOEXEC... needs runtime check
checking whether fcntl is declared without a macro... yes
checking whether openat is declared without a macro... yes
checking whether fdopendir is declared... (cached) yes
checking whether fdopendir works... yes
checking whether fflush works on input streams... (cached) no
checking for working POSIX fnmatch... no
checking whether isblank is declared... yes
checking whether fpurge is declared... no
checking whether fflush works on input streams... (cached) no
checking for sys/mount.h... yes
configure: checking how to get file system space usage
checking for statvfs function (SVR4)... no
checking for 3-argument statfs function (DEC OSF/1)... no
checking for two-argument statfs with statfs.f_bsize member (AIX, 4.3BSD)... yes
checking dustat.h usability... no
checking dustat.h presence... no
checking for dustat.h... no
checking sys/fs/s5param.h usability... no
checking sys/fs/s5param.h presence... no
checking for sys/fs/s5param.h... no
checking sys/filsys.h usability... no
checking sys/filsys.h presence... no
checking for sys/filsys.h... no
checking sys/statfs.h usability... yes
checking sys/statfs.h presence... yes
checking for sys/statfs.h... yes
checking for statfs that truncates block counts... no
checking for ftello... yes
checking whether ftello works... yes
checking whether futimens works... no
configure: checking how to do getaddrinfo, freeaddrinfo and getnameinfo
checking for library containing getaddrinfo... none required
checking for getaddrinfo... yes
checking whether gai_strerror is declared... (cached) yes
checking whether gai_strerrorA is declared... no
checking for gai_strerror with POSIX signature... yes
checking for struct sockaddr.sa_len... no
checking whether getaddrinfo is declared... (cached) yes
checking whether freeaddrinfo is declared... (cached) yes
checking whether getnameinfo is declared... (cached) yes
checking for struct addrinfo... yes
checking for working getdelim function... yes
checking for getline... yes
checking for working getline function... yes
checking whether getlogin_r works with small buffers... yes
checking whether gettimeofday clobbers localtime buffer... no
checking for gettimeofday with POSIX signature... almost
checking glob.h usability... yes
checking glob.h presence... yes
checking for glob.h... yes
checking for GNU glob interface version 1... yes
checking whether glob lists broken symlinks... no
checking for library containing gethostbyname... (cached) none required
checking for gethostbyname... (cached) yes
checking for library containing inet_ntop... (cached) none required
checking whether inet_ntop is declared... (cached) yes
checking for lchown... yes
checking for pthread_rwlock_t... yes
checking whether lseek detects pipes... yes
checking whether mbrtowc handles incomplete characters... guessing yes
checking whether mbrtowc works as well as mbtowc... guessing yes
checking whether mbrtowc handles a NULL pwc argument... guessing yes
checking whether mbrtowc handles a NULL string argument... guessing yes
checking whether mbrtowc has a correct return value... guessing yes
checking whether mbrtowc returns 0 when parsing a NUL character... guessing yes
checking whether mbrtowc handles incomplete characters... (cached) guessing yes
checking whether mbrtowc works as well as mbtowc... (cached) guessing yes
checking whether mbrtowc handles incomplete characters... (cached) guessing yes
checking whether mbrtowc works as well as mbtowc... (cached) guessing yes
checking whether mbsrtowcs works... guessing yes
checking for mempcpy... (cached) yes
checking for memrchr... yes
checking whether mkdir handles trailing slash... yes
checking whether mkdir handles trailing dot... yes
checking for mkdtemp... yes
checking whether getaddrinfo is declared without a macro... (cached) yes
checking whether freeaddrinfo is declared without a macro... (cached) yes
checking whether gai_strerror is declared without a macro... (cached) yes
checking whether getnameinfo is declared without a macro... (cached) yes
checking whether <netinet/in.h> is self-contained... yes
checking whether open recognizes a trailing slash... yes
checking for fchmodat... yes
checking for fstatat... (cached) yes
checking for mkdirat... yes
checking for openat... yes
checking for unlinkat... yes
checking for fchownat... yes
checking whether fchownat works with AT_SYMLINK_NOFOLLOW... yes
checking whether fchownat works with an empty file name... yes
checking whether pread works... yes
checking for rawmemchr... yes
checking whether readlink signature is correct... yes
checking whether readlink handles trailing slash correctly... yes
checking whether rmdir works... yes
checking whether select supports a 0 argument... yes
checking for library containing getservbyname... (cached) none required
checking for getservbyname... (cached) yes
checking for stdint.h... (cached) yes
checking for SIZE_MAX... yes
checking whether sleep is declared... yes
checking for working sleep... yes
checking for snprintf... (cached) yes
checking whether snprintf respects a size of 1... yes
checking for library containing setsockopt... (cached) none needed
checking for socklen_t... yes
checking for ssize_t... (cached) yes
checking whether stat handles trailing slashes on directories... yes
checking whether stat handles trailing slashes on files... yes
checking for struct stat.st_atim.tv_nsec... yes
checking whether struct stat.st_atim is of type struct timespec... yes
checking for struct stat.st_birthtimespec.tv_nsec... no
checking for struct stat.st_birthtimensec... no
checking for struct stat.st_birthtim.tv_nsec... no
checking whether NULL can be used in arbitrary expressions... yes
checking whether dprintf is declared without a macro... yes
checking whether fpurge is declared without a macro... no
checking whether fseeko is declared without a macro... yes
checking whether ftello is declared without a macro... yes
checking whether getdelim is declared without a macro... yes
checking whether getline is declared without a macro... yes
checking whether popen is declared without a macro... yes
checking whether renameat is declared without a macro... yes
checking whether snprintf is declared without a macro... yes
checking whether tmpfile is declared without a macro... yes
checking whether vdprintf is declared without a macro... yes
checking whether vsnprintf is declared without a macro... yes
checking whether _Exit is declared without a macro... yes
checking whether atoll is declared without a macro... yes
checking whether canonicalize_file_name is declared without a macro... yes
checking whether getloadavg is declared without a macro... yes
checking whether getsubopt is declared without a macro... yes
checking whether grantpt is declared without a macro... yes
checking whether mkdtemp is declared without a macro... yes
checking whether mkostemp is declared without a macro... yes
checking whether mkostemps is declared without a macro... yes
checking whether mkstemp is declared without a macro... yes
checking whether mkstemps is declared without a macro... yes
checking whether ptsname is declared without a macro... yes
checking whether random_r is declared without a macro... yes
checking whether initstat_r is declared without a macro... no
checking whether srandom_r is declared without a macro... yes
checking whether setstate_r is declared without a macro... yes
checking whether realpath is declared without a macro... yes
checking whether rpmatch is declared without a macro... yes
checking whether setenv is declared without a macro... yes
checking whether strtod is declared without a macro... yes
checking whether strtoll is declared without a macro... yes
checking whether strtoull is declared without a macro... yes
checking whether unlockpt is declared without a macro... yes
checking whether unsetenv is declared without a macro... yes
checking for strchrnul... yes
checking whether strchrnul works... yes
checking for working strerror function... yes
checking for strerror_r... (cached) yes
checking for strerror_r with POSIX signature... (cached) no
checking for __xpg_strerror_r... (cached) yes
checking for working strndup... yes
checking for working strnlen... yes
checking whether symlink handles trailing slash correctly... yes
checking whether <sys/select.h> is self-contained... (cached) yes
checking whether select is declared without a macro... (cached) yes
checking whether <sys/socket.h> is self-contained... (cached) yes
checking for shutdown... (cached) yes
checking whether <sys/socket.h> defines the SHUT_* macros... (cached) yes
checking for struct sockaddr_storage... (cached) yes
checking for sa_family_t... (cached) yes
checking for struct sockaddr_storage.ss_family... (cached) yes
checking whether socket is declared without a macro... (cached) yes
checking whether connect is declared without a macro... (cached) yes
checking whether accept is declared without a macro... (cached) yes
checking whether bind is declared without a macro... (cached) yes
checking whether getpeername is declared without a macro... (cached) yes
checking whether getsockname is declared without a macro... (cached) yes
checking whether getsockopt is declared without a macro... (cached) yes
checking whether listen is declared without a macro... (cached) yes
checking whether recv is declared without a macro... (cached) yes
checking whether send is declared without a macro... (cached) yes
checking whether recvfrom is declared without a macro... (cached) yes
checking whether sendto is declared without a macro... (cached) yes
checking whether setsockopt is declared without a macro... (cached) yes
checking whether shutdown is declared without a macro... (cached) yes
checking whether accept4 is declared without a macro... (cached) yes
checking for nlink_t... yes
checking whether fchmodat is declared without a macro... yes
checking whether fstatat is declared without a macro... yes
checking whether futimens is declared without a macro... yes
checking whether lchmod is declared without a macro... yes
checking whether lstat is declared without a macro... yes
checking whether mkdirat is declared without a macro... yes
checking whether mkfifo is declared without a macro... yes
checking whether mkfifoat is declared without a macro... yes
checking whether mknod is declared without a macro... yes
checking whether mknodat is declared without a macro... yes
checking whether stat is declared without a macro... yes
checking whether utimensat is declared without a macro... yes
checking whether waitpid is declared without a macro... yes
checking whether chown is declared without a macro... yes
checking whether dup2 is declared without a macro... yes
checking whether dup3 is declared without a macro... yes
checking whether environ is declared without a macro... yes
checking whether euidaccess is declared without a macro... yes
checking whether faccessat is declared without a macro... yes
checking whether fchdir is declared without a macro... yes
checking whether fchownat is declared without a macro... yes
checking whether fsync is declared without a macro... yes
checking whether ftruncate is declared without a macro... yes
checking whether getcwd is declared without a macro... yes
checking whether getdomainname is declared without a macro... yes
checking whether getdtablesize is declared without a macro... yes
checking whether getgroups is declared without a macro... yes
checking whether gethostname is declared without a macro... yes
checking whether getlogin is declared without a macro... yes
checking whether getlogin_r is declared without a macro... yes
checking whether getpagesize is declared without a macro... yes
checking whether getusershell is declared without a macro... yes
checking whether setusershell is declared without a macro... yes
checking whether endusershell is declared without a macro... yes
checking whether group_member is declared without a macro... yes
checking whether lchown is declared without a macro... yes
checking whether link is declared without a macro... yes
checking whether linkat is declared without a macro... yes
checking whether lseek is declared without a macro... yes
checking whether pipe is declared without a macro... yes
checking whether pipe2 is declared without a macro... yes
checking whether pread is declared without a macro... yes
checking whether pwrite is declared without a macro... yes
checking whether readlink is declared without a macro... yes
checking whether readlinkat is declared without a macro... yes
checking whether rmdir is declared without a macro... yes
checking whether sleep is declared without a macro... yes
checking whether symlink is declared without a macro... yes
checking whether symlinkat is declared without a macro... yes
checking whether ttyname_r is declared without a macro... yes
checking whether unlink is declared without a macro... yes
checking whether unlinkat is declared without a macro... yes
checking whether usleep is declared without a macro... yes
checking whether unlink honors trailing slashes... (cached) yes
checking whether unlink of a parent directory fails as it should... (cached) guessing yes
checking for ptrdiff_t... yes
checking for vasprintf... yes
checking whether btowc is declared without a macro... yes
checking whether wctob is declared without a macro... yes
checking whether mbsinit is declared without a macro... yes
checking whether mbrtowc is declared without a macro... yes
checking whether mbrlen is declared without a macro... yes
checking whether mbsrtowcs is declared without a macro... yes
checking whether mbsnrtowcs is declared without a macro... yes
checking whether wcrtomb is declared without a macro... yes
checking whether wcsrtombs is declared without a macro... yes
checking whether wcsnrtombs is declared without a macro... yes
checking whether wcwidth is declared without a macro... yes
checking whether wmemchr is declared without a macro... yes
checking whether wmemcmp is declared without a macro... yes
checking whether wmemcpy is declared without a macro... yes
checking whether wmemmove is declared without a macro... yes
checking whether wmemset is declared without a macro... yes
checking whether wcslen is declared without a macro... yes
checking whether wcsnlen is declared without a macro... yes
checking whether wcscpy is declared without a macro... yes
checking whether wcpcpy is declared without a macro... yes
checking whether wcsncpy is declared without a macro... yes
checking whether wcpncpy is declared without a macro... yes
checking whether wcscat is declared without a macro... yes
checking whether wcsncat is declared without a macro... yes
checking whether wcscmp is declared without a macro... yes
checking whether wcsncmp is declared without a macro... yes
checking whether wcscasecmp is declared without a macro... yes
checking whether wcsncasecmp is declared without a macro... yes
checking whether wcscoll is declared without a macro... yes
checking whether wcsxfrm is declared without a macro... yes
checking whether wcsdup is declared without a macro... yes
checking whether wcschr is declared without a macro... yes
checking whether wcsrchr is declared without a macro... yes
checking whether wcscspn is declared without a macro... yes
checking whether wcsspn is declared without a macro... yes
checking whether wcspbrk is declared without a macro... yes
checking whether wcsstr is declared without a macro... yes
checking whether wcstok is declared without a macro... yes
checking whether wcswidth is declared without a macro... yes
checking whether iswcntrl works... yes
checking for wctype_t... yes
checking for wctrans_t... yes
checking whether wctype is declared without a macro... yes
checking whether iswctype is declared without a macro... yes
checking whether wctrans is declared without a macro... yes
checking whether towctrans is declared without a macro... yes
checking for stdint.h... (cached) yes
checking whether btowc(0) is correct... yes
checking whether btowc(EOF) is correct... guessing yes
checking for a traditional french locale... (cached) none
checking for a french Unicode locale... (cached) none
checking whether getgroups handles negative values... yes
checking for getpagesize... yes
checking whether getpagesize is declared... (cached) yes
checking whether byte ordering is bigendian... no
checking for library containing inet_pton... none required
checking whether inet_pton is declared... (cached) yes
checking whether byte ordering is bigendian... (cached) no
checking whether INT32_MAX < INTMAX_MAX... yes
checking whether INT64_MAX == LONG_MAX... yes
checking whether UINT32_MAX < UINTMAX_MAX... yes
checking whether UINT64_MAX == ULONG_MAX... yes
checking for ioctl... yes
checking for ioctl with POSIX signature... no
checking whether locale.h conforms to POSIX:2001... yes
checking whether locale.h defines locale_t... yes
checking whether setlocale is declared without a macro... yes
checking whether duplocale is declared without a macro... yes
checking for setlocale... yes
checking for uselocale... yes
checking for a traditional french locale... (cached) none
checking for a french Unicode locale... (cached) none
checking for a traditional japanese locale... (cached) none
checking for a transitional chinese locale... (cached) none
checking for a french Unicode locale... (cached) none
checking for a traditional french locale... (cached) none
checking for a french Unicode locale... (cached) none
checking for a traditional japanese locale... (cached) none
checking for a transitional chinese locale... (cached) none
checking for mmap... (cached) yes
checking for MAP_ANONYMOUS... yes
checking for mmap... (cached) yes
checking for MAP_ANONYMOUS... yes
checking for getppriv... no
checking whether program_invocation_name is declared... yes
checking whether program_invocation_short_name is declared... yes
checking for putenv compatible with GNU and SVID... yes
checking for mmap... (cached) yes
checking for MAP_ANONYMOUS... yes
checking for stdlib.h... (cached) yes
checking for GNU libc compatible realloc... yes
checking whether setenv validates arguments... yes
checking for a traditional french locale... (cached) none
checking for a french Unicode locale... (cached) none
checking for a traditional japanese locale... (cached) none
checking for a transitional chinese locale... (cached) none
checking for wchar_t... (cached) yes
checking for wint_t... (cached) yes
checking for mmap... (cached) yes
checking for MAP_ANONYMOUS... yes
checking whether <sys/ioctl.h> declares ioctl... yes
checking whether ioctl is declared without a macro... yes
checking for pthread_atfork... yes
checking for unsetenv... yes
checking for unsetenv() return type... int
checking whether unsetenv obeys POSIX... yes
checking for useconds_t... yes
checking whether usleep allows large arguments... yes
checking whether mbrtowc handles incomplete characters... (cached) guessing yes
checking whether mbrtowc works as well as mbtowc... (cached) guessing yes
checking whether wcrtomb return value is correct... guessing yes
checking for a traditional french locale... (cached) none
checking for a french Unicode locale... (cached) none
checking for a traditional japanese locale... (cached) none
checking for a transitional chinese locale... (cached) none
checking whether wctob works... guessing yes
checking whether wctob is declared... (cached) yes
checking for sched_yield in -lrt... yes
checking whether compiler handles -Werror... yes
checking whether -Wno-missing-field-initializers is supported... yes
checking whether -Wno-missing-field-initializers is needed... yes
checking whether compiler handles -Wall... yes
checking whether compiler handles -W... yes
checking whether compiler handles -Wformat-y2k... yes
checking whether compiler handles -Wformat-nonliteral... yes
checking whether compiler handles -Wformat-security... yes
checking whether compiler handles -Winit-self... yes
checking whether compiler handles -Wmissing-include-dirs... yes
checking whether compiler handles -Wswitch-default... yes
checking whether compiler handles -Wswitch-enum... yes
checking whether compiler handles -Wunused... yes
checking whether compiler handles -Wunknown-pragmas... yes
checking whether compiler handles -Wstrict-aliasing... yes
checking whether compiler handles -Wstrict-overflow... yes
checking whether compiler handles -Wfloat-equal... yes
checking whether compiler handles -Wpointer-arith... yes
checking whether compiler handles -Wbad-function-cast... yes
checking whether compiler handles -Wcast-align... yes
checking whether compiler handles -Wwrite-strings... yes
checking whether compiler handles -Wstrict-prototypes... yes
checking whether compiler handles -Wold-style-definition... yes
checking whether compiler handles -Wmissing-prototypes... yes
checking whether compiler handles -Wmissing-declarations... yes
checking whether compiler handles -Wmissing-noreturn... yes
checking whether compiler handles -Wpacked... yes
checking whether compiler handles -Wnested-externs... yes
checking whether compiler handles -Winvalid-pch... yes
checking whether compiler handles -Wvolatile-register-var... yes
checking whether compiler handles -Wdisabled-optimization... yes
checking whether compiler handles -Woverlength-strings... yes
checking whether compiler handles -Wbuiltin-macro-redefined... yes
checking whether compiler handles -Wmudflap... yes
checking whether compiler handles -Wpacked-bitfield-compat... yes
checking whether compiler handles -Wsync-nand... yes
checking whether compiler handles -Wattributes... yes
checking whether compiler handles -Wcoverage-mismatch... yes
checking whether compiler handles -Wmultichar... yes
checking whether compiler handles -Wunused-macros... yes
checking whether compiler handles -Wno-missing-field-initializers... yes
checking whether compiler handles -Wno-unused-parameter... yes
checking whether compiler handles -Wno-jump-misses-init... yes
checking whether compiler handles -Wno-unused-variable... yes
checking whether compiler handles -Wno-logical-op... yes
checking whether compiler handles -fdiagnostics-show-option... yes
checking for function prototypes... yes
checking for special C compiler options needed for large files... (cached) no
checking for _FILE_OFFSET_BITS value needed for large files... (cached) no
checking for dirent.h that defines DIR... yes
checking for library containing opendir... none required
checking for struct dirent.d_type... yes
checking for struct stat.st_blocks... yes
checking for struct stat.st_blksize... yes
checking for gperf... gperf
checking for aug_match in -laugeas... yes
checking for aug_load... yes
checking for aug_defvar... yes
checking for aug_defnode... yes
checking selinux/selinux.h usability... yes
checking selinux/selinux.h presence... yes
checking for selinux/selinux.h... yes
checking for setexeccon in -lselinux... yes
checking for setcon... yes
checking for getcon... yes
checking for xdrmem_create in -lportablexdr... no
checking for library containing xdrmem_create... none required
checking for getxattr... yes
checking for htonl... yes
checking for htons... yes
checking for inotify_init1... yes
checking for lgetxattr... yes
checking for listxattr... yes
checking for llistxattr... yes
checking for lsetxattr... yes
checking for lremovexattr... yes
checking for mknod... yes
checking for ntohl... yes
checking for ntohs... yes
checking for posix_fallocate... yes
checking for realpath... yes
checking for removexattr... yes
checking for setitimer... yes
checking for setxattr... yes
checking for sigaction... yes
checking for statvfs... yes
checking for sync... yes
checking attr/xattr.h usability... no
checking attr/xattr.h presence... no
checking for attr/xattr.h... no
checking printf.h usability... yes
checking printf.h presence... yes
checking for printf.h... yes
checking sys/inotify.h usability... yes
checking sys/inotify.h presence... yes
checking for sys/inotify.h... yes
checking sys/statvfs.h usability... yes
checking sys/statvfs.h presence... yes
checking for sys/statvfs.h... yes
checking sys/xattr.h usability... yes
checking sys/xattr.h presence... yes
checking for sys/xattr.h... yes
checking windows.h usability... no
checking windows.h presence... no
checking for windows.h... no
checking for register_printf_specifier... yes
configure: creating ./config.status
config.status: creating Makefile
config.status: creating lib/Makefile
config.status: creating tests/Makefile
config.status: creating config.h
config.status: config.h is unchanged
config.status: executing depfiles commands


------------------------------------------------------------
Thank you for downloading libguestfs 1.11.18

This is how we have configured the optional components for you today:

Daemon .............................. yes
Appliance ........................... yes
QEMU ................................ /usr/bin/qemu-system-x86_64
OCaml bindings ...................... yes
Perl bindings ....................... yes
Python bindings ..................... yes
Ruby bindings ....................... no
Java bindings ....................... yes
Haskell bindings .................... no
PHP bindings ........................ no
guestfish and C virt tools .......... yes
Perl virt tools ..................... yes
virt-resize ......................... yes
FUSE filesystem ..................... yes

If any optional component is configured 'no' when you expected 'yes'
then you should check the preceeding messages.

Please report bugs back to the mailing list:
http://www.redhat.com/mailman/listinfo/libguestfs

Next you should type 'make' to build the package,
then 'make check' to run the tests.
------------------------------------------------------------
+ make clean
Making clean in po-docs
make[1]: Entering directory `/home/rjones/d/libguestfs/po-docs'
Making clean in uk
make[2]: Entering directory `/home/rjones/d/libguestfs/po-docs/uk'
test -z "*.1 *.3" || rm -f *.1 *.3
rm -rf .libs _libs
rm -f *.lo
make[2]: Leaving directory `/home/rjones/d/libguestfs/po-docs/uk'
Making clean in ja
make[2]: Entering directory `/home/rjones/d/libguestfs/po-docs/ja'
test -z "*.1 *.3" || rm -f *.1 *.3
rm -rf .libs _libs
rm -f *.lo
make[2]: Leaving directory `/home/rjones/d/libguestfs/po-docs/ja'
Making clean in .
make[2]: Entering directory `/home/rjones/d/libguestfs/po-docs'
test -z "po4a.conf" || rm -f po4a.conf
rm -rf .libs _libs
rm -f *.lo
make[2]: Leaving directory `/home/rjones/d/libguestfs/po-docs'
make[1]: Leaving directory `/home/rjones/d/libguestfs/po-docs'
Making clean in fuse
make[1]: Entering directory `/home/rjones/d/libguestfs/fuse'
 rm -f guestmount
test -z "stamp-guestmount.pod" || rm -f stamp-guestmount.pod
rm -rf .libs _libs
rm -f *.o
rm -f *.lo
make[1]: Leaving directory `/home/rjones/d/libguestfs/fuse'
Making clean in tools
make[1]: Entering directory `/home/rjones/d/libguestfs/tools'
test -z "test.img" || rm -f test.img
rm -rf .libs _libs
rm -f *.lo
make[1]: Leaving directory `/home/rjones/d/libguestfs/tools'
Making clean in resize
make[1]: Entering directory `/home/rjones/d/libguestfs/resize'
rm -f .depend .depend-t
ocamlfind ocamldep -package pcre -I ../src/.libs -I ../ocaml progress.ml resize.ml utils.ml | \
	  /bin/sed -e :a -e '/ *\\$/N; s/ *\\\n */ /; ta' | \
	  sort > .depend-t
mv .depend-t .depend
 cd .. && /bin/sh /home/rjones/d/libguestfs/build-aux/missing --run automake-1.11 --foreign resize/Makefile
resize/Makefile.am:102: .PHONY was already defined in condition TRUE, which includes condition HAVE_OCAML_PCRE and HAVE_OCAML ...
subdir-rules.mk:19: ... `.PHONY' previously defined here
resize/Makefile.am:18:   `subdir-rules.mk' included from here
automake-1.11: SOURCES was already defined in condition HAVE_OCAML_PCRE and HAVE_OCAML, which is included in condition TRUE ...
resize/Makefile.am:31: ... `SOURCES' previously defined here
 cd .. && /bin/sh ./config.status resize/Makefile 
config.status: creating resize/Makefile
make[1]: Leaving directory `/home/rjones/d/libguestfs/resize'
make[1]: Entering directory `/home/rjones/d/libguestfs/resize'
test -z "*~ *.cmi *.cmo *.cmx *.cmxa *.o virt-resize test.img stamp-virt-resize.pod" || rm -f *~ *.cmi *.cmo *.cmx *.cmxa *.o virt-resize test.img stamp-virt-resize.pod
rm -rf .libs _libs
rm -f *.lo
make[1]: Leaving directory `/home/rjones/d/libguestfs/resize'
Making clean in csharp
make[1]: Entering directory `/home/rjones/d/libguestfs/csharp'
rm -rf .libs _libs
rm -f *.lo
make[1]: Leaving directory `/home/rjones/d/libguestfs/csharp'
Making clean in java
make[1]: Entering directory `/home/rjones/d/libguestfs/java'
test -z "doc-stamp ./com/redhat/et/libguestfs/*.class com_redhat_et_libguestfs_GuestFS.h *.class *.jar api/com/redhat/et/libguestfs/*.html api/*" || rm -f doc-stamp ./com/redhat/et/libguestfs/*.class com_redhat_et_libguestfs_GuestFS.h *.class *.jar api/com/redhat/et/libguestfs/*.html api/*
rm: cannot remove `api/com': Is a directory
rm: cannot remove `api/resources': Is a directory
make[1]: [clean-generic] Error 1 (ignored)
test -z "libguestfs_jni.la" || rm -f libguestfs_jni.la
rm -f "./so_locations"
rm -rf .libs _libs
rm -f *.o
rm -f *.lo
make[1]: Leaving directory `/home/rjones/d/libguestfs/java'
Making clean in python/examples
make[1]: Entering directory `/home/rjones/d/libguestfs/python/examples'
test -z "*.pyc *.pyo stamp-guestfs-python.pod" || rm -f *.pyc *.pyo stamp-guestfs-python.pod
rm -rf .libs _libs
rm -f *.lo
make[1]: Leaving directory `/home/rjones/d/libguestfs/python/examples'
Making clean in python
make[1]: Entering directory `/home/rjones/d/libguestfs/python'
rm -rf .libs _libs
test -z "libguestfsmod.la" || rm -f libguestfsmod.la
rm -f "./so_locations"
rm -f *.o
rm -f *.lo
make[1]: Leaving directory `/home/rjones/d/libguestfs/python'
Making clean in ocaml/examples
make[1]: Entering directory `/home/rjones/d/libguestfs/ocaml/examples'
test -z "*.cmi *.cmo *.cmx *.o create_disk inspect_vm stamp-guestfs-ocaml.pod" || rm -f *.cmi *.cmo *.cmx *.o create_disk inspect_vm stamp-guestfs-ocaml.pod
rm -rf .libs _libs
rm -f *.lo
make[1]: Leaving directory `/home/rjones/d/libguestfs/ocaml/examples'
Making clean in ocaml
make[1]: Entering directory `/home/rjones/d/libguestfs/ocaml'
make -C ../generator stamp-generator
make[2]: Entering directory `/home/rjones/d/libguestfs/generator'
rm -f .depend .depend-t
ocamldep generator_types.ml generator_utils.mli generator_utils.ml generator_actions.mli generator_actions.ml generator_structs.mli generator_structs.ml generator_api_versions.mli generator_api_versions.ml generator_optgroups.ml generator_prepopts.mli generator_prepopts.ml generator_events.ml generator_pr.mli generator_pr.ml generator_docstrings.ml generator_checks.ml generator_c.ml generator_xdr.ml generator_daemon.ml generator_capitests.ml generator_fish.ml generator_ocaml.ml generator_perl.ml generator_python.ml generator_ruby.ml generator_java.ml generator_haskell.ml generator_csharp.ml generator_php.ml generator_bindtests.ml generator_errnostring.ml generator_main.ml | sed 's/  *$//' > .depend-t
mv .depend-t .depend
 cd .. && /bin/sh /home/rjones/d/libguestfs/build-aux/missing --run automake-1.11 --foreign generator/Makefile
 cd .. && /bin/sh ./config.status generator/Makefile 
config.status: creating generator/Makefile
make[2]: Leaving directory `/home/rjones/d/libguestfs/generator'
make[2]: Entering directory `/home/rjones/d/libguestfs/generator'
ocamlc.opt -warn-error CDEFLMPSUVYZX -c generator_actions.ml -o generator_actions.cmo
ocamlc.opt -warn-error CDEFLMPSUVYZX -c generator_c.ml -o generator_c.cmo
ocamlc.opt -warn-error CDEFLMPSUVYZX -c generator_daemon.ml -o generator_daemon.cmo
ocamlc.opt -warn-error CDEFLMPSUVYZX -c generator_fish.ml -o generator_fish.cmo
ocamlc.opt -warn-error CDEFLMPSUVYZX -c generator_ocaml.ml -o generator_ocaml.cmo
ocamlc.opt -warn-error CDEFLMPSUVYZX -c generator_perl.ml -o generator_perl.cmo
ocamlc.opt -warn-error CDEFLMPSUVYZX -c generator_python.ml -o generator_python.cmo
ocamlc.opt -warn-error CDEFLMPSUVYZX -c generator_ruby.ml -o generator_ruby.cmo
ocamlc.opt -warn-error CDEFLMPSUVYZX -c generator_java.ml -o generator_java.cmo
ocamlc.opt -warn-error CDEFLMPSUVYZX -c generator_php.ml -o generator_php.cmo
ocamlc.opt -warn-error CDEFLMPSUVYZX -c generator_bindtests.ml -o generator_bindtests.cmo
ocamlc.opt -warn-error CDEFLMPSUVYZX -c generator_main.ml -o generator_main.cmo
ocamlc.opt -o generator -warn-error CDEFLMPSUVYZX unix.cma str.cma generator_types.cmo generator_utils.cmo generator_actions.cmo generator_structs.cmo generator_api_versions.cmo generator_optgroups.cmo generator_prepopts.cmo generator_events.cmo generator_pr.cmo generator_docstrings.cmo generator_checks.cmo generator_c.cmo generator_xdr.cmo generator_daemon.cmo generator_capitests.cmo generator_fish.cmo generator_ocaml.cmo generator_perl.cmo generator_python.cmo generator_ruby.cmo generator_java.cmo generator_haskell.cmo generator_csharp.cmo generator_php.cmo generator_bindtests.cmo generator_errnostring.cmo generator_main.cmo
mkdir -p ../perl/lib/Sys
mkdir -p ../ruby/ext/guestfs
mkdir -p ../java/com/redhat/et/libguestfs
mkdir -p ../csharp
cd .. && generator/generator
written src/guestfs_protocol.x
written src/guestfs.h
written src/guestfs-internal-actions.h
written src/actions.c
written src/guestfs-actions.pod
written src/guestfs-availability.pod
written src/libguestfs.syms
written daemon/actions.h
written daemon/stubs.c
written daemon/names.c
written daemon/optgroups.c
written daemon/optgroups.h
written capitests/tests.c
written fish/cmds_gperf.gperf
written fish/cmds.c
written fish/completion.c
written fish/guestfish-actions.pod
written ocaml/guestfs.mli
written ocaml/guestfs.ml
written ocaml/guestfs_c_actions.c
written perl/Guestfs.xs
written perl/lib/Sys/Guestfs.pm
written python/guestfs-py.c
written python/guestfs.py
written ruby/ext/guestfs/_guestfs.c
written java/com/redhat/et/libguestfs/GuestFS.java
written java/com_redhat_et_libguestfs_GuestFS.c
written haskell/Guestfs.hs
written csharp/Libguestfs.cs
written php/extension/php_guestfs_php.h
written php/extension/guestfs_php.c
generated 218491 lines of code
make[2]: Leaving directory `/home/rjones/d/libguestfs/generator'
rm -f .depend .depend-t
ocamlfind ocamldep guestfs.mli bindtests.ml guestfs.ml | sed 's/  *$//' | sort > .depend-t
mv .depend-t .depend
 cd .. && /bin/sh /home/rjones/d/libguestfs/build-aux/missing --run automake-1.11 --foreign ocaml/Makefile
 cd .. && /bin/sh ./config.status ocaml/Makefile 
config.status: creating ocaml/Makefile
make[1]: Leaving directory `/home/rjones/d/libguestfs/ocaml'
make[1]: Entering directory `/home/rjones/d/libguestfs/ocaml'
make -C ../generator stamp-generator
make[2]: Entering directory `/home/rjones/d/libguestfs/generator'
make[2]: `stamp-generator' is up to date.
make[2]: Leaving directory `/home/rjones/d/libguestfs/generator'
test -z "*.cmi *.cmo *.cmx *.cma *.cmxa *.o *.a *.so t/*.cmi t/*.cmo t/*.cmx t/*.o t/*.a t/*.so mlguestfs.cma mlguestfs.cmxa META bindtests t/guestfs_005_load t/guestfs_010_basic t/guestfs_070_threads t/guestfs_080_optargs t/guestfs_400_events t/guestfs_400_progress" || rm -f *.cmi *.cmo *.cmx *.cma *.cmxa *.o *.a *.so t/*.cmi t/*.cmo t/*.cmx t/*.o t/*.a t/*.so mlguestfs.cma mlguestfs.cmxa META bindtests t/guestfs_005_load t/guestfs_010_basic t/guestfs_070_threads t/guestfs_080_optargs t/guestfs_400_events t/guestfs_400_progress
rm -rf .libs _libs
rm -f *.lo
make[1]: Leaving directory `/home/rjones/d/libguestfs/ocaml'
Making clean in perl/examples
make[1]: Entering directory `/home/rjones/d/libguestfs/perl/examples'
test -z "stamp-guestfs-perl.pod" || rm -f stamp-guestfs-perl.pod
rm -rf .libs _libs
rm -f *.lo
make[1]: Leaving directory `/home/rjones/d/libguestfs/perl/examples'
Making clean in perl
make[1]: Entering directory `/home/rjones/d/libguestfs/perl'
rm -rf .libs _libs
make -f Makefile-pl clean
make[2]: Entering directory `/home/rjones/d/libguestfs/perl'
make[2]: Makefile-pl: No such file or directory
make[2]: *** No rule to make target `Makefile-pl'.  Stop.
make[2]: Leaving directory `/home/rjones/d/libguestfs/perl'
make[1]: [clean-local] Error 2 (ignored)
rm -f Makefile-pl
rm -f *.lo
make[1]: Leaving directory `/home/rjones/d/libguestfs/perl'
Making clean in rescue
make[1]: Entering directory `/home/rjones/d/libguestfs/rescue'
 rm -f virt-rescue
test -z "stamp-virt-rescue.pod" || rm -f stamp-virt-rescue.pod
rm -rf .libs _libs
rm -f *.o
rm -f *.lo
make[1]: Leaving directory `/home/rjones/d/libguestfs/rescue'
Making clean in inspector
make[1]: Entering directory `/home/rjones/d/libguestfs/inspector'
 rm -f virt-inspector
test -z "stamp-virt-inspector.pod" || rm -f stamp-virt-inspector.pod
rm -rf .libs _libs
rm -f *.o
rm -f *.lo
make[1]: Leaving directory `/home/rjones/d/libguestfs/inspector'
Making clean in edit
make[1]: Entering directory `/home/rjones/d/libguestfs/edit'
 rm -f virt-edit
test -z "stamp-virt-edit.pod" || rm -f stamp-virt-edit.pod
rm -rf .libs _libs
rm -f *.o
rm -f *.lo
make[1]: Leaving directory `/home/rjones/d/libguestfs/edit'
Making clean in df
make[1]: Entering directory `/home/rjones/d/libguestfs/df'
 rm -f virt-df
test -z "stamp-virt-df.pod" || rm -f stamp-virt-df.pod
rm -rf .libs _libs
rm -f *.o
rm -f *.lo
make[1]: Leaving directory `/home/rjones/d/libguestfs/df'
Making clean in cat
make[1]: Entering directory `/home/rjones/d/libguestfs/cat'
 rm -f virt-cat virt-filesystems virt-ls
test -z "stamp-virt-cat.pod stamp-virt-ls.pod stamp-virt-filesystems.pod" || rm -f stamp-virt-cat.pod stamp-virt-ls.pod stamp-virt-filesystems.pod
rm -rf .libs _libs
rm -f *.o
rm -f *.lo
make[1]: Leaving directory `/home/rjones/d/libguestfs/cat'
Making clean in fish
make[1]: Entering directory `/home/rjones/d/libguestfs/fish'
 rm -f guestfish
test -z "stamp-guestfish.pod stamp-virt-copy-in.pod stamp-virt-copy-out.pod stamp-virt-tar-in.pod stamp-virt-tar-out.pod" || rm -f stamp-guestfish.pod stamp-virt-copy-in.pod stamp-virt-copy-out.pod stamp-virt-tar-in.pod stamp-virt-tar-out.pod
rm -rf .libs _libs
test -z "libcmds.la librc_protocol.la" || rm -f libcmds.la librc_protocol.la
rm -f "./so_locations"
rm -f "./so_locations"
rm -f *.o
rm -f *.lo
make[1]: Leaving directory `/home/rjones/d/libguestfs/fish'
Making clean in test-tool
make[1]: Entering directory `/home/rjones/d/libguestfs/test-tool'
 rm -f libguestfs-test-tool
test -z "" || rm -f 
rm -rf .libs _libs
rm -f *.o
rm -f *.lo
make[1]: Leaving directory `/home/rjones/d/libguestfs/test-tool'
Making clean in regressions
make[1]: Entering directory `/home/rjones/d/libguestfs/regressions'
 rm -f rhbz501893
rm -rf .libs _libs
rm -f *.o
rm -f *.lo
make[1]: Leaving directory `/home/rjones/d/libguestfs/regressions'
Making clean in caution
make[1]: Entering directory `/home/rjones/d/libguestfs/caution'
rm -rf .libs _libs
rm -f *.lo
make[1]: Leaving directory `/home/rjones/d/libguestfs/caution'
Making clean in capitests
make[1]: Entering directory `/home/rjones/d/libguestfs/capitests'
 rm -f tests test-command test-just-header test-create-handle test-config test-add-drive-opts test-last-errno test-private-data test-user-cancel test-debug-to-file
rm -rf .libs _libs
rm -f *.o
rm -f *.lo
make[1]: Leaving directory `/home/rjones/d/libguestfs/capitests'
Making clean in gnulib/tests
make[1]: Entering directory `/home/rjones/d/libguestfs/gnulib/tests'
Making clean in .
make[2]: Entering directory `/home/rjones/d/libguestfs/gnulib/tests'
test -z "libtests.a" || rm -f libtests.a
 rm -f test-alignof test-alloca-opt test-argmatch test-arpa_inet test-binary-io test-bitrotate test-btowc test-c-ctype test-chown test-cloexec test-dirent-safer test-dirent test-dup2 test-environ test-errno test-fchdir test-fclose test-fcntl-h test-fcntl-safer test-fcntl test-fdopendir test-fflush test-fflush2 test-filevercmp test-fpending test-fpurge test-freading test-fseeko test-ftell test-ftell3 test-ftello test-ftello3 test-getcwd-lgpl test-getdtablesize test-getgroups test-getopt test-hash test-i-ring test-ignore-value test-intprops test-inttostr test-inttypes test-lchown test-locale test-localename test-lock test-lseek test-lstat test-malloca test-mbrtowc test-mbrtowc-w32 test-mbsinit test-memchr test-memrchr test-mkdir test-netinet_in test-open test-openat-safer test-fchownat test-fstatat test-mkdirat test-openat test-unlinkat test-priv-set test-quotearg-simple test-rawmemchr test-realloc-gnu test-rmdir test-setenv test-setlocale1 test-setlocale2 test-sleep test-snpr!
 intf test-stat test-stat-time test-stdbool test-stddef test-stdint test-stdio test-stdlib test-strchrnul test-strerror test-string test-strnlen test-symlink test-sys_socket test-sys_stat test-sys_uio test-time test-dup-safer test-unistd test-unlink test-unsetenv test-usleep test-vasnprintf test-vasprintf test-verify test-wchar test-wcrtomb test-wcrtomb-w32 test-wctype-h test-xalloc-die test-xstrtol test-xstrtoul test-xstrtoll test-xstrtoull test-xstrtoumax test-xvasprintf
test -z "" || rm -f 
rm -rf .libs _libs
rm -rf SunWS_cache
test -z "" || rm -f 
rm -f *.o
rm -f glthread/thread.o
test -z "core *.stackdump arg-nonnull.h arg-nonnull.h-t c++defs.h c++defs.h-t test-fflush.txt test-fpending.t t-fpurge.tmp t-freading.tmp t-ftell3.tmp t-ftello3.tmp locale.h locale.h-t warn-on-use.h warn-on-use.h-t" || rm -f core *.stackdump arg-nonnull.h arg-nonnull.h-t c++defs.h c++defs.h-t test-fflush.txt test-fpending.t t-fpurge.tmp t-freading.tmp t-ftell3.tmp t-ftello3.tmp locale.h locale.h-t warn-on-use.h warn-on-use.h-t
rm -f *.lo
make[2]: Leaving directory `/home/rjones/d/libguestfs/gnulib/tests'
make[1]: Leaving directory `/home/rjones/d/libguestfs/gnulib/tests'
Making clean in appliance
make[1]: Entering directory `/home/rjones/d/libguestfs/appliance'
test -z "packagelist excludelist" || rm -f packagelist excludelist
rm -rf .libs _libs
rm -rf supermin.d
rm -f *.lo
make[1]: Leaving directory `/home/rjones/d/libguestfs/appliance'
Making clean in daemon
make[1]: Entering directory `/home/rjones/d/libguestfs/daemon'
Making clean in tests
make[2]: Entering directory `/home/rjones/d/libguestfs/daemon/tests'
Making clean in .
make[3]: Entering directory `/home/rjones/d/libguestfs/daemon/tests'
test -z "libtests.a" || rm -f libtests.a
test -z "test-alignof test-alloca-opt test-arpa_inet test-binary-io test-bitrotate test-btowc test-byteswap test-c-ctype test-chown test-cloexec test-dirent test-dup2 test-environ test-errno test-fchdir test-fclose test-fcntl-h test-fcntl test-fdopendir test-fflush test-fflush2 test-fnmatch test-fpurge test-freading test-fseeko test-ftell test-ftell3 test-ftello test-ftello3 test-futimens test-getaddrinfo test-getcwd-lgpl test-getdelim test-getdtablesize test-getgroups test-getline test-getlogin_r test-gettimeofday test-glob test-hash test-ignore-value test-inet_ntop test-inet_pton test-intprops test-inttostr test-inttypes test-lchown test-locale test-localename test-lock test-lseek test-lstat test-malloca test-mbrtowc test-mbrtowc-w32 test-mbsinit test-mbsrtowcs test-memchr test-memrchr test-mkdir test-netdb test-netinet_in test-open test-fchownat test-fstatat test-mkdirat test-openat test-unlinkat test-perror test-perror2 test-pipe test-pread test-priv-set test-rawmemchr t!
 est-read-file test-readlink test-realloc-gnu test-rmdir test-select test-select-fd test-select-stdin test-setenv test-setlocale1 test-setlocale2 test-sleep test-snprintf test-sockets test-stat test-stat-time test-stdbool test-stddef test-stdint test-stdio test-stdlib test-strchrnul test-strerror test-strerror_r test-string test-strnlen test-symlink test-symlinkat test-sys_ioctl test-sys_select test-sys_socket test-sys_stat test-sys_time test-sys_uio test-sys_wait test-time test-dup-safer test-unistd test-unlink test-unsetenv test-usleep test-utimens test-vasnprintf test-vasprintf test-verify test-wchar test-wcrtomb test-wcrtomb-w32 test-wctype-h" || rm -f test-alignof test-alloca-opt test-arpa_inet test-binary-io test-bitrotate test-btowc test-byteswap test-c-ctype test-chown test-cloexec test-dirent test-dup2 test-environ test-errno test-fchdir test-fclose test-fcntl-h test-fcntl test-fdopendir test-fflush test-fflush2 test-fnmatch test-fpurge test-freading test-fseeko tes!
 t-ftell test-ftell3 test-ftello test-ftello3 test-futimens test-getadd
rinfo test-getcwd-lgpl test-getdelim test-getdtablesize test-getgroups test-getline test-getlogin_r test-gettimeofday test-glob test-hash test-ignore-value test-inet_ntop test-inet_pton test-intprops test-inttostr test-inttypes test-lchown test-locale test-localename test-lock test-lseek test-lstat test-malloca test-mbrtowc test-mbrtowc-w32 test-mbsinit test-mbsrtowcs test-memchr test-memrchr test-mkdir test-netdb test-netinet_in test-open test-fchownat test-fstatat test-mkdirat test-openat test-unlinkat test-perror test-perror2 test-pipe test-pread test-priv-set test-rawmemchr test-read-file test-readlink test-realloc-gnu test-rmdir test-select test-select-fd test-select-stdin test-setenv test-setlocale1 test-setlocale2 test-sleep test-snprintf test-sockets test-stat test-stat-time test-stdbool test-stddef test-stdint test-stdio test-stdlib test-strchrnul test-strerror test-strerror_r test-string test-strnlen test-symlink test-symlinkat test-sys_ioctl test-sys_select test-s!
 ys_socket test-sys_stat test-sys_time test-sys_uio test-sys_wait test-time test-dup-safer test-unistd test-unlink test-unsetenv test-usleep test-utimens test-vasnprintf test-vasprintf test-verify test-wchar test-wcrtomb test-wcrtomb-w32 test-wctype-h
test -z "" || rm -f 
rm -rf SunWS_cache
test -z "" || rm -f 
test -z "" || rm -f 
rm -f *.o
rm -f glthread/thread.o
test -z "core *.stackdump arg-nonnull.h arg-nonnull.h-t c++defs.h c++defs.h-t test-fflush.txt t-fpurge.tmp t-freading.tmp t-ftell3.tmp t-ftello3.tmp test-getdelim.txt test-getline.txt inttypes.h inttypes.h-t locale.h locale.h-t sys/ioctl.h sys/ioctl.h-t warn-on-use.h warn-on-use.h-t" || rm -f core *.stackdump arg-nonnull.h arg-nonnull.h-t c++defs.h c++defs.h-t test-fflush.txt t-fpurge.tmp t-freading.tmp t-ftell3.tmp t-ftello3.tmp test-getdelim.txt test-getline.txt inttypes.h inttypes.h-t locale.h locale.h-t sys/ioctl.h sys/ioctl.h-t warn-on-use.h warn-on-use.h-t
rmdir sys
make[3]: Leaving directory `/home/rjones/d/libguestfs/daemon/tests'
make[2]: Leaving directory `/home/rjones/d/libguestfs/daemon/tests'
Making clean in lib
make[2]: Entering directory `/home/rjones/d/libguestfs/daemon/lib'
Making clean in .
make[3]: Entering directory `/home/rjones/d/libguestfs/daemon/lib'
test -z "configmake.h configmake.h-t charset.alias ref-add.sed ref-del.sed" || rm -f configmake.h configmake.h-t charset.alias ref-add.sed ref-del.sed
test -z "libgnu.a" || rm -f libgnu.a
test -z "" || rm -f 
rm -f *.o
rm -f glthread/lock.o
rm -f glthread/threadlib.o
test -z "core *.stackdump alloca.h alloca.h-t arg-nonnull.h arg-nonnull.h-t arpa/inet.h arpa/inet.h-t byteswap.h byteswap.h-t c++defs.h c++defs.h-t dirent.h dirent.h-t errno.h errno.h-t fcntl.h fcntl.h-t float.h float.h-t fnmatch.h fnmatch.h-t glob.h glob.h-t netdb.h netdb.h-t netinet/in.h netinet/in.h-t stdbool.h stdbool.h-t stddef.h stddef.h-t stdint.h stdint.h-t stdio.h stdio.h-t stdlib.h stdlib.h-t string.h string.h-t sys/select.h sys/select.h-t sys/socket.h sys/socket.h-t sys/stat.h sys/stat.h-t sys/time.h sys/time.h-t sys/uio.h sys/uio.h-t sys/wait.h sys/wait.h-t time.h time.h-t unistd.h unistd.h-t warn-on-use.h warn-on-use.h-t wchar.h wchar.h-t wctype.h wctype.h-t" || rm -f core *.stackdump alloca.h alloca.h-t arg-nonnull.h arg-nonnull.h-t arpa/inet.h arpa/inet.h-t byteswap.h byteswap.h-t c++defs.h c++defs.h-t dirent.h dirent.h-t errno.h errno.h-t fcntl.h fcntl.h-t float.h float.h-t fnmatch.h fnmatch.h-t glob.h glob.h-t netdb.h netdb.h-t netinet/in.h netinet/in.h-t st!
 dbool.h stdbool.h-t stddef.h stddef.h-t stdint.h stdint.h-t stdio.h stdio.h-t stdlib.h stdlib.h-t string.h string.h-t sys/select.h sys/select.h-t sys/socket.h sys/socket.h-t sys/stat.h sys/stat.h-t sys/time.h sys/time.h-t sys/uio.h sys/uio.h-t sys/wait.h sys/wait.h-t time.h time.h-t unistd.h unistd.h-t warn-on-use.h warn-on-use.h-t wchar.h wchar.h-t wctype.h wctype.h-t
rmdir arpa
rmdir sys
make[3]: Leaving directory `/home/rjones/d/libguestfs/daemon/lib'
make[2]: Leaving directory `/home/rjones/d/libguestfs/daemon/lib'
Making clean in .
make[2]: Entering directory `/home/rjones/d/libguestfs/daemon'
test -z "libprotocol.a liberrnostring.a" || rm -f libprotocol.a liberrnostring.a
test -z "guestfsd" || rm -f guestfsd
test -z "" || rm -f 
rm -f *.o
make[2]: Leaving directory `/home/rjones/d/libguestfs/daemon'
make[1]: Leaving directory `/home/rjones/d/libguestfs/daemon'
Making clean in po
make[1]: Entering directory `/home/rjones/d/libguestfs/po'
rm -f *.insert-header
rm -f remove-potcdate.sed
rm -f stamp-poT
rm -f core core.* libguestfs.po libguestfs.1po libguestfs.2po *.new.po
rm -fr *.o
make[1]: Leaving directory `/home/rjones/d/libguestfs/po'
Making clean in examples
make[1]: Entering directory `/home/rjones/d/libguestfs/examples'
test -z "stamp-guestfs-examples.pod stamp-guestfs-recipes.pod" || rm -f stamp-guestfs-examples.pod stamp-guestfs-recipes.pod
rm -rf .libs _libs
 rm -f create_disk inspect_vm virt-dhcp-address
rm -f *.o
rm -f *.lo
make[1]: Leaving directory `/home/rjones/d/libguestfs/examples'
Making clean in src
make[1]: Entering directory `/home/rjones/d/libguestfs/src'
test -z "stamp-guestfs.pod" || rm -f stamp-guestfs.pod
test -z "libguestfs.la" || rm -f libguestfs.la
rm -f "./so_locations"
rm -rf .libs _libs
test -z "liberrnostring.la libprotocol.la" || rm -f liberrnostring.la libprotocol.la
rm -f "./so_locations"
rm -f "./so_locations"
rm -f *.o
rm -f *.lo
make[1]: Leaving directory `/home/rjones/d/libguestfs/src'
Making clean in generator
make[1]: Entering directory `/home/rjones/d/libguestfs/generator'
test -z "stamp-generator generator *.cmi *.cmo *~" || rm -f stamp-generator generator *.cmi *.cmo *~
rm -rf .libs _libs
rm -f *.lo
make[1]: Leaving directory `/home/rjones/d/libguestfs/generator'
Making clean in images
make[1]: Entering directory `/home/rjones/d/libguestfs/images'
test -z "test.iso test.sqsh 100kallzeroes 100kallnewlines 100kallspaces 100krandom 10klines initrd debian.img fedora.img ubuntu.img windows.img" || rm -f test.iso test.sqsh 100kallzeroes 100kallnewlines 100kallspaces 100krandom 10klines initrd debian.img fedora.img ubuntu.img windows.img
rm -rf .libs _libs
rm -f *.lo
make[1]: Leaving directory `/home/rjones/d/libguestfs/images'
Making clean in gnulib/lib
make[1]: Entering directory `/home/rjones/d/libguestfs/gnulib/lib'
Making clean in .
make[2]: Entering directory `/home/rjones/d/libguestfs/gnulib/lib'
test -z "configmake.h configmake.h-t charset.alias ref-add.sed ref-del.sed" || rm -f configmake.h configmake.h-t charset.alias ref-add.sed ref-del.sed
rm -rf .libs _libs
rm -rf glthread/.libs glthread/_libs
test -z "" || rm -f 
test -z "libgnu.la" || rm -f libgnu.la
rm -f "./so_locations"
rm -f *.o
rm -f glthread/lock.o
rm -f glthread/lock.lo
rm -f glthread/threadlib.o
rm -f glthread/threadlib.lo
test -z "core *.stackdump alloca.h alloca.h-t arg-nonnull.h arg-nonnull.h-t arpa/inet.h arpa/inet.h-t c++defs.h c++defs.h-t dirent.h dirent.h-t errno.h errno.h-t fcntl.h fcntl.h-t float.h float.h-t getopt.h getopt.h-t inttypes.h inttypes.h-t netinet/in.h netinet/in.h-t stdarg.h stdarg.h-t stdbool.h stdbool.h-t stddef.h stddef.h-t stdint.h stdint.h-t stdio.h stdio.h-t stdlib.h stdlib.h-t string.h string.h-t sys/socket.h sys/socket.h-t sys/stat.h sys/stat.h-t sys/uio.h sys/uio.h-t time.h time.h-t unistd.h unistd.h-t warn-on-use.h warn-on-use.h-t wchar.h wchar.h-t wctype.h wctype.h-t" || rm -f core *.stackdump alloca.h alloca.h-t arg-nonnull.h arg-nonnull.h-t arpa/inet.h arpa/inet.h-t c++defs.h c++defs.h-t dirent.h dirent.h-t errno.h errno.h-t fcntl.h fcntl.h-t float.h float.h-t getopt.h getopt.h-t inttypes.h inttypes.h-t netinet/in.h netinet/in.h-t stdarg.h stdarg.h-t stdbool.h stdbool.h-t stddef.h stddef.h-t stdint.h stdint.h-t stdio.h stdio.h-t stdlib.h stdlib.h-t string.h s!
 tring.h-t sys/socket.h sys/socket.h-t sys/stat.h sys/stat.h-t sys/uio.h sys/uio.h-t time.h time.h-t unistd.h unistd.h-t warn-on-use.h warn-on-use.h-t wchar.h wchar.h-t wctype.h wctype.h-t
rm -f *.lo
rmdir arpa
rmdir sys
make[2]: Leaving directory `/home/rjones/d/libguestfs/gnulib/lib'
make[1]: Leaving directory `/home/rjones/d/libguestfs/gnulib/lib'
Making clean in .
make[1]: Entering directory `/home/rjones/d/libguestfs'
test -z "pod2htm?.tmp html/*.html" || rm -f pod2htm?.tmp html/*.html
rm -rf .libs _libs
rm -f *.lo
make[1]: Leaving directory `/home/rjones/d/libguestfs'
+ make
(CDPATH="${ZSH_VERSION+.}:" && cd . && /bin/sh /home/rjones/d/libguestfs/build-aux/missing --run autoheader)
rm -f stamp-h1
touch config.h.in
cd . && /bin/sh ./config.status config.h
config.status: creating config.h
config.status: config.h is unchanged
make  all-recursive
make[1]: Entering directory `/home/rjones/d/libguestfs'
Making all in gnulib/lib
make[2]: Entering directory `/home/rjones/d/libguestfs/gnulib/lib'
  GEN    alloca.h
  GEN    arg-nonnull.h
  GEN    c++defs.h
  GEN    warn-on-use.h
  GEN    arpa/inet.h
  GEN    configmake.h
  GEN    dirent.h
  GEN    fcntl.h
  GEN    inttypes.h
  GEN    stdio.h
  GEN    stdlib.h
  GEN    string.h
  GEN    sys/socket.h
  GEN    sys/stat.h
  GEN    sys/uio.h
  GEN    time.h
  GEN    unistd.h
  GEN    wchar.h
  GEN    wctype.h
make  all-recursive
make[3]: Entering directory `/home/rjones/d/libguestfs/gnulib/lib'
make[4]: Entering directory `/home/rjones/d/libguestfs/gnulib/lib'
  CC     c-ctype.lo
  CC     exitfail.lo
  CC     fd-hook.lo
  CC     filevercmp.lo
  CC     freading.lo
  CC     full-read.lo
  CC     full-write.lo
  CC     hash-pjw.lo
  CC     localcharset.lo
  CC     glthread/lock.lo
  CC     malloca.lo
  CC     openat-die.lo
  CC     progname.lo
  CC     glthread/threadlib.lo
  CC     xalloc-die.lo
  CC     xstrtoumax.lo
  CC     xvasprintf.lo
  CC     xasprintf.lo
  CC     argmatch.lo
  CC     asnprintf.lo
  CC     basename-lgpl.lo
  CC     chdir-long.lo
  CC     cloexec.lo
  CC     close-stream.lo
  CC     closeout.lo
  CC     creat-safer.lo
  CC     cycle-check.lo
  CC     dirname-lgpl.lo
  CC     dup-safer.lo
  CC     fclose.lo
  CC     fcntl.lo
  CC     fd-safer.lo
  CC     fflush.lo
  CC     filenamecat-lgpl.lo
  CC     fpurge.lo
  CC     fseeko.lo
  CC     fts.lo
  CC     hash.lo
  CC     human.lo
  CC     i-ring.lo
  CC     open-safer.lo
  CC     openat-proc.lo
  CC     openat-safer.lo
  CC     opendir-safer.lo
  CC     pipe-safer.lo
  CC     printf-args.lo
  CC     printf-parse.lo
  CC     quote.lo
  CC     quotearg.lo
  CC     safe-read.lo
  CC     safe-write.lo
  CC     save-cwd.lo
  CC     stripslash.lo
  CC     vasnprintf.lo
  CC     xmalloc.lo
  CC     xstrtol.lo
  CC     xstrtol-error.lo
  CC     xstrtoll.lo
  CC     xstrtoul.lo
  CC     xstrtoull.lo
  CCLD   libgnu.la
  GEN    charset.alias
  GEN    ref-add.sed
  GEN    ref-del.sed
make[4]: Leaving directory `/home/rjones/d/libguestfs/gnulib/lib'
make[3]: Leaving directory `/home/rjones/d/libguestfs/gnulib/lib'
make[2]: Leaving directory `/home/rjones/d/libguestfs/gnulib/lib'
Making all in images
make[2]: Entering directory `/home/rjones/d/libguestfs/images'
rm -f 100kallzeroes 100kallzeroes-t
dd if=/dev/zero of=100kallzeroes-t bs=1024 count=100
100+0 records in
100+0 records out
102400 bytes (102 kB) copied, 0.000286227 s, 358 MB/s
mv 100kallzeroes-t 100kallzeroes
rm -f 100kallnewlines 100kallnewlines-t
tr '\0' '\n' < 100kallzeroes > 100kallnewlines-t
mv 100kallnewlines-t 100kallnewlines
rm -f 100kallspaces 100kallspaces-t
tr '\0' ' ' < 100kallzeroes > 100kallspaces-t
mv 100kallspaces-t 100kallspaces
rm -f 100krandom 100krandom-t
dd if=/dev/urandom of=100krandom-t bs=1024 count=100
100+0 records in
100+0 records out
102400 bytes (102 kB) copied, 0.0140876 s, 7.3 MB/s
mv 100krandom-t 100krandom
rm -f 10klines 10klines-t
i=0; \
	while [ $i -lt 10000 ]; do \
	  echo "${i}abcdefghijklmnopqrstuvwxyz"; \
	  i=$(($i+1)); \
	done > 10klines-t
mv 10klines-t 10klines
ln -sf /10klines abssymlink
rm -f initrd initrd-t
for f in empty known-1 known-2 known-3 known-4 known-5; do echo $f; done | cpio -o -H newc | gzip --best > initrd-t
4 blocks
mv initrd-t initrd
rm -f test.iso test.iso-t
mkdir -p directory
/usr/bin/genisoimage -J -r -graft-points \
	  -o test.iso-t \
	  ./helloworld.tar ./helloworld.tar.gz ./helloworld.tar.xz ./empty ./known-1 ./known-2 ./known-3 ./known-4 ./known-5 ./bin-i586-dynamic ./bin-sparc-dynamic ./bin-win32.exe ./bin-win64.exe ./bin-x86_64-dynamic ./lib-i586.so ./lib-sparc.so ./lib-win32.dll ./lib-win64.dll ./lib-x86_64.so ./test-grep.txt ./100kallzeroes ./100kallnewlines ./100kallspaces ./100krandom ./10klines ./abssymlink ./hello.b64 ./initrd ./initrd-x86_64.img ./initrd-x86_64.img.gz ./test-grep.txt.gz /directory=directory
Total translation table size: 0
Total rockridge attributes bytes: 3010
Total directory bytes: 2048
Path table size(bytes): 26
Max brk space used 0
635 extents written (1 MB)
rmdir directory
mv test.iso-t test.iso
make[2]: Leaving directory `/home/rjones/d/libguestfs/images'
Making all in generator
make[2]: Entering directory `/home/rjones/d/libguestfs/generator'
ocamlc.opt -warn-error CDEFLMPSUVYZX -c generator_types.ml -o generator_types.cmo
ocamlc.opt -warn-error CDEFLMPSUVYZX -c generator_utils.mli -o generator_utils.cmi
ocamlc.opt -warn-error CDEFLMPSUVYZX -c generator_utils.ml -o generator_utils.cmo
ocamlc.opt -warn-error CDEFLMPSUVYZX -c generator_actions.mli -o generator_actions.cmi
ocamlc.opt -warn-error CDEFLMPSUVYZX -c generator_actions.ml -o generator_actions.cmo
ocamlc.opt -warn-error CDEFLMPSUVYZX -c generator_structs.mli -o generator_structs.cmi
ocamlc.opt -warn-error CDEFLMPSUVYZX -c generator_structs.ml -o generator_structs.cmo
ocamlc.opt -warn-error CDEFLMPSUVYZX -c generator_api_versions.mli -o generator_api_versions.cmi
ocamlc.opt -warn-error CDEFLMPSUVYZX -c generator_api_versions.ml -o generator_api_versions.cmo
ocamlc.opt -warn-error CDEFLMPSUVYZX -c generator_optgroups.ml -o generator_optgroups.cmo
ocamlc.opt -warn-error CDEFLMPSUVYZX -c generator_prepopts.mli -o generator_prepopts.cmi
ocamlc.opt -warn-error CDEFLMPSUVYZX -c generator_prepopts.ml -o generator_prepopts.cmo
ocamlc.opt -warn-error CDEFLMPSUVYZX -c generator_events.ml -o generator_events.cmo
ocamlc.opt -warn-error CDEFLMPSUVYZX -c generator_pr.mli -o generator_pr.cmi
ocamlc.opt -warn-error CDEFLMPSUVYZX -c generator_pr.ml -o generator_pr.cmo
ocamlc.opt -warn-error CDEFLMPSUVYZX -c generator_docstrings.ml -o generator_docstrings.cmo
ocamlc.opt -warn-error CDEFLMPSUVYZX -c generator_checks.ml -o generator_checks.cmo
ocamlc.opt -warn-error CDEFLMPSUVYZX -c generator_c.ml -o generator_c.cmo
ocamlc.opt -warn-error CDEFLMPSUVYZX -c generator_xdr.ml -o generator_xdr.cmo
ocamlc.opt -warn-error CDEFLMPSUVYZX -c generator_daemon.ml -o generator_daemon.cmo
ocamlc.opt -warn-error CDEFLMPSUVYZX -c generator_capitests.ml -o generator_capitests.cmo
ocamlc.opt -warn-error CDEFLMPSUVYZX -c generator_fish.ml -o generator_fish.cmo
ocamlc.opt -warn-error CDEFLMPSUVYZX -c generator_ocaml.ml -o generator_ocaml.cmo
ocamlc.opt -warn-error CDEFLMPSUVYZX -c generator_perl.ml -o generator_perl.cmo
ocamlc.opt -warn-error CDEFLMPSUVYZX -c generator_python.ml -o generator_python.cmo
ocamlc.opt -warn-error CDEFLMPSUVYZX -c generator_ruby.ml -o generator_ruby.cmo
ocamlc.opt -warn-error CDEFLMPSUVYZX -c generator_java.ml -o generator_java.cmo
ocamlc.opt -warn-error CDEFLMPSUVYZX -c generator_haskell.ml -o generator_haskell.cmo
ocamlc.opt -warn-error CDEFLMPSUVYZX -c generator_csharp.ml -o generator_csharp.cmo
ocamlc.opt -warn-error CDEFLMPSUVYZX -c generator_php.ml -o generator_php.cmo
ocamlc.opt -warn-error CDEFLMPSUVYZX -c generator_bindtests.ml -o generator_bindtests.cmo
ocamlc.opt -warn-error CDEFLMPSUVYZX -c generator_errnostring.ml -o generator_errnostring.cmo
ocamlc.opt -warn-error CDEFLMPSUVYZX -c generator_main.ml -o generator_main.cmo
ocamlc.opt -o generator -warn-error CDEFLMPSUVYZX unix.cma str.cma generator_types.cmo generator_utils.cmo generator_actions.cmo generator_structs.cmo generator_api_versions.cmo generator_optgroups.cmo generator_prepopts.cmo generator_events.cmo generator_pr.cmo generator_docstrings.cmo generator_checks.cmo generator_c.cmo generator_xdr.cmo generator_daemon.cmo generator_capitests.cmo generator_fish.cmo generator_ocaml.cmo generator_perl.cmo generator_python.cmo generator_ruby.cmo generator_java.cmo generator_haskell.cmo generator_csharp.cmo generator_php.cmo generator_bindtests.cmo generator_errnostring.cmo generator_main.cmo
mkdir -p ../perl/lib/Sys
mkdir -p ../ruby/ext/guestfs
mkdir -p ../java/com/redhat/et/libguestfs
mkdir -p ../csharp
cd .. && generator/generator
generated 218491 lines of code
make[2]: Leaving directory `/home/rjones/d/libguestfs/generator'
Making all in src
make[2]: Entering directory `/home/rjones/d/libguestfs/src'
make -C ../generator stamp-generator
make[3]: Entering directory `/home/rjones/d/libguestfs/generator'
make[3]: `stamp-generator' is up to date.
make[3]: Leaving directory `/home/rjones/d/libguestfs/generator'
rm -f guestfs_protocol.c-t guestfs_protocol.c-t2
rpcgen -c -o guestfs_protocol.c-t guestfs_protocol.x
sed 's,\.\./\.\./src/,,' < guestfs_protocol.c-t > guestfs_protocol.c-t2
rm guestfs_protocol.c-t
mv guestfs_protocol.c-t2 guestfs_protocol.c
rm -f guestfs_protocol.h-t
rpcgen -h -o guestfs_protocol.h-t guestfs_protocol.x
mv guestfs_protocol.h-t guestfs_protocol.h
make  all-am
make[3]: Entering directory `/home/rjones/d/libguestfs/src'
make -C ../generator stamp-generator
make[4]: Entering directory `/home/rjones/d/libguestfs/generator'
make[4]: `stamp-generator' is up to date.
make[4]: Leaving directory `/home/rjones/d/libguestfs/generator'
  CC     libguestfs_la-guestfs.lo
  CC     libguestfs_la-actions.lo
  CC     libguestfs_la-appliance.lo
  CC     libguestfs_la-bindtests.lo
  CC     libguestfs_la-dbdump.lo
  CC     libguestfs_la-events.lo
  CC     libguestfs_la-filearch.lo
  CC     libguestfs_la-inspect.lo
  CC     libguestfs_la-inspect_apps.lo
  CC     libguestfs_la-inspect_fs.lo
  CC     libguestfs_la-inspect_fs_cd.lo
  CC     libguestfs_la-inspect_fs_unix.lo
  CC     libguestfs_la-inspect_fs_windows.lo
  CC     libguestfs_la-inspect_icon.lo
  CC     libguestfs_la-launch.lo
  CC     libguestfs_la-listfs.lo
  CC     libguestfs_la-match.lo
  CC     libguestfs_la-proto.lo
  CC     libguestfs_la-virt.lo
  CC     liberrnostring_la-errnostring_gperf.lo
  CC     liberrnostring_la-errnostring.lo
  CCLD   liberrnostring.la
  CC     libprotocol_la-guestfs_protocol.lo
  CCLD   libprotocol.la
  CCLD   libguestfs.la
../podwrapper.sh \
	  --section 3 \
	  --man guestfs.3 \
	  --html ../html/guestfs.3.html \
	  --insert guestfs-actions.pod:@ACTIONS@ \
	  --insert guestfs-availability.pod:@AVAILABILITY@ \
	  --insert guestfs-structs.pod:@STRUCTS@ \
	  guestfs.pod
/usr/bin/pod2html: -: unknown pod directive 'encoding' in paragraph 1.  ignoring.
/usr/bin/pod2html: -: cannot resolve L<dd(1)> in paragraph 23.
/usr/bin/pod2html: -: cannot resolve L<posix_fallocate(3)> in paragraph 23.
/usr/bin/pod2html: -: cannot resolve L<mksquashfs(8)> in paragraph 70.
/usr/bin/pod2html: -: cannot resolve L<mkisofs(8)> in paragraph 70.
/usr/bin/pod2html: -: cannot resolve L<dd(1)> in paragraph 77.
/usr/bin/pod2html: -: cannot resolve L<guestfish(1)> in paragraph 93.
/usr/bin/pod2html: -: cannot resolve L<readdir(3)> in paragraph 95.
/usr/bin/pod2html: -: cannot resolve L<load_policy(8)> in paragraph 132.
/usr/bin/pod2html: -: cannot resolve L<umask(2)> in paragraph 145.
/usr/bin/pod2html: -: cannot resolve L<hivexml(1)> in paragraph 178.
/usr/bin/pod2html: -: cannot resolve L<hivexsh(1)> in paragraph 178.
/usr/bin/pod2html: -: cannot resolve L<hivexregedit(1)> in paragraph 178.
/usr/bin/pod2html: -: cannot resolve L<virt-win-reg(1)> in paragraph 178.
/usr/bin/pod2html: -: cannot resolve L<guestfish(1)> in paragraph 213.
/usr/bin/pod2html: -: cannot resolve L<guestfish(3)> in paragraph 225.
/usr/bin/pod2html: -: cannot resolve L<guestfish(3)> in paragraph 230.
/usr/bin/pod2html: -: cannot resolve L<mlock(2)> in paragraph 252.
/usr/bin/pod2html: -: cannot resolve L<guestfish(1)> in paragraph 272.
/usr/bin/pod2html: -: cannot resolve L<abort(3)> in paragraph 391.
/usr/bin/pod2html: -: cannot resolve L<abort(3)> in paragraph 424.
/usr/bin/pod2html: -: cannot resolve L<guestfs(3)/ATTACHING TO RUNNING DAEMONS> in paragraph 454.
/usr/bin/pod2html: -: cannot resolve L<augtool(1)> in paragraph 521.
/usr/bin/pod2html: -: cannot resolve L<environ(3)> in paragraph 586.
/usr/bin/pod2html: -: cannot resolve L<environ(3)> in paragraph 591.
/usr/bin/pod2html: -: cannot resolve L<guestfs(3)/AVAILABILITY> in paragraph 619.
/usr/bin/pod2html: -: cannot resolve L<guestfs(3)/AVAILABILITY> in paragraph 641.
/usr/bin/pod2html: -: cannot resolve L<environ(3)> in paragraph 642.
/usr/bin/pod2html: -: cannot resolve L<blockdev(8)> in paragraph 657.
/usr/bin/pod2html: -: cannot resolve L<blockdev(8)> in paragraph 664.
/usr/bin/pod2html: -: cannot resolve L<blockdev(8)> in paragraph 670.
/usr/bin/pod2html: -: cannot resolve L<blockdev(8)> in paragraph 677.
/usr/bin/pod2html: -: cannot resolve L<blockdev(8)> in paragraph 684.
/usr/bin/pod2html: -: cannot resolve L<blockdev(8)> in paragraph 691.
/usr/bin/pod2html: -: cannot resolve L<blockdev(8)> in paragraph 697.
/usr/bin/pod2html: -: cannot resolve L<blockdev(8)> in paragraph 704.
/usr/bin/pod2html: -: cannot resolve L<blockdev(8)> in paragraph 710.
/usr/bin/pod2html: -: cannot resolve L<blockdev(8)> in paragraph 716.
/usr/bin/pod2html: -: cannot resolve L<guestfs(3)/PROTOCOL LIMITS> in paragraph 758.
/usr/bin/pod2html: -: cannot resolve L<guestfs(3)/PROTOCOL LIMITS> in paragraph 818.
/usr/bin/pod2html: -: cannot resolve L<environ(3)> in paragraph 824.
/usr/bin/pod2html: -: cannot resolve L<guestfs(3)/PROTOCOL LIMITS> in paragraph 825.
/usr/bin/pod2html: -: cannot resolve L<guestfs(3)/GUESTFS_EVENT_PROGRESS> in paragraph 839.
/usr/bin/pod2html: -: cannot resolve L<guestfs(3)/GUESTFS_EVENT_PROGRESS> in paragraph 881.
/usr/bin/pod2html: -: cannot resolve L<guestfs(3)/GUESTFS_EVENT_PROGRESS> in paragraph 890.
/usr/bin/pod2html: -: cannot resolve L<sync(2)> in paragraph 896.
/usr/bin/pod2html: -: cannot resolve L<guestfs(3)/GUESTFS_EVENT_PROGRESS> in paragraph 905.
/usr/bin/pod2html: -: cannot resolve L<environ(3)> in paragraph 923.
/usr/bin/pod2html: -: cannot resolve L<guestfs(3)/PROTOCOL LIMITS> in paragraph 924.
/usr/bin/pod2html: -: cannot resolve L<environ(3)> in paragraph 929.
/usr/bin/pod2html: -: cannot resolve L<guestfs(3)/PROTOCOL LIMITS> in paragraph 930.
/usr/bin/pod2html: -: cannot resolve L<cmp(1)> in paragraph 935.
/usr/bin/pod2html: -: cannot resolve L<environ(3)> in paragraph 963.
/usr/bin/pod2html: -: cannot resolve L<guestfs(3)/PROTOCOL LIMITS> in paragraph 964.
/usr/bin/pod2html: -: cannot resolve L<environ(3)> in paragraph 969.
/usr/bin/pod2html: -: cannot resolve L<guestfs(3)/PROTOCOL LIMITS> in paragraph 970.
/usr/bin/pod2html: -: cannot resolve L<file(1)> in paragraph 974.
/usr/bin/pod2html: -: cannot resolve L<file(1)> in paragraph 977.
/usr/bin/pod2html: -: cannot resolve L<file(1)> in paragraph 978.
/usr/bin/pod2html: -: cannot resolve L<guestfs(3)/GUESTFS_EVENT_PROGRESS> in paragraph 1044.
/usr/bin/pod2html: -: cannot resolve L<guestfs(3)/GUESTFS_EVENT_PROGRESS> in paragraph 1050.
/usr/bin/pod2html: -: cannot resolve L<environ(3)> in paragraph 1062.
/usr/bin/pod2html: -: cannot resolve L<guestfs(3)/PROTOCOL LIMITS> in paragraph 1063.
/usr/bin/pod2html: -: cannot resolve L<find(1)> in paragraph 1073.
/usr/bin/pod2html: -: cannot resolve L<fsck(8)> in paragraph 1096.
/usr/bin/pod2html: -: cannot resolve L<guestfs(3)> in paragraph 1148.
/usr/bin/pod2html: -: cannot resolve L<guestfs(3)> in paragraph 1186.
/usr/bin/pod2html: -: cannot resolve L<guestfs(3)> in paragraph 1192.
/usr/bin/pod2html: -: cannot resolve L<guestfs(3)> in paragraph 1213.
/usr/bin/pod2html: -: cannot resolve L<attr(5)> in paragraph 1221.
/usr/bin/pod2html: -: cannot resolve L<listxattr(2)> in paragraph 1227.
/usr/bin/pod2html: -: cannot resolve L<getxattr(2)> in paragraph 1227.
/usr/bin/pod2html: -: cannot resolve L<attr(5)> in paragraph 1228.
/usr/bin/pod2html: -: cannot resolve L<glob(3)> in paragraph 1235.
/usr/bin/pod2html: -: cannot resolve L<environ(3)> in paragraph 1236.
/usr/bin/pod2html: -: cannot resolve L<environ(3)> in paragraph 1241.
/usr/bin/pod2html: -: cannot resolve L<guestfs(3)/PROTOCOL LIMITS> in paragraph 1242.
/usr/bin/pod2html: -: cannot resolve L<environ(3)> in paragraph 1247.
/usr/bin/pod2html: -: cannot resolve L<guestfs(3)/PROTOCOL LIMITS> in paragraph 1248.
/usr/bin/pod2html: -: cannot resolve L<environ(3)> in paragraph 1261.
/usr/bin/pod2html: -: cannot resolve L<guestfs(3)/PROTOCOL LIMITS> in paragraph 1262.
/usr/bin/pod2html: -: cannot resolve L<environ(3)> in paragraph 1269.
/usr/bin/pod2html: -: cannot resolve L<guestfs(3)/PROTOCOL LIMITS> in paragraph 1270.
/usr/bin/pod2html: -: cannot resolve L<guestfs(3)/PROTOCOL LIMITS> in paragraph 1276.
/usr/bin/pod2html: -: cannot resolve L<guestfs(3)/PROTOCOL LIMITS> in paragraph 1285.
/usr/bin/pod2html: -: cannot resolve L<environ(3)> in paragraph 1292.
/usr/bin/pod2html: -: cannot resolve L<environ(3)> in paragraph 1309.
/usr/bin/pod2html: -: cannot resolve L<guestfs(3)/INSPECTION> in paragraph 1337.
/usr/bin/pod2html: -: cannot resolve L<guestfs(3)/INSPECTION> in paragraph 1379.
/usr/bin/pod2html: -: cannot resolve L<guestfs(3)/INSPECTION> in paragraph 1390.
/usr/bin/pod2html: -: cannot resolve L<guestfs(3)/INSPECTION> in paragraph 1397.
/usr/bin/pod2html: -: cannot resolve L<environ(3)> in paragraph 1398.
/usr/bin/pod2html: -: cannot resolve L<guestfs(3)/INSPECTION> in paragraph 1413.
/usr/bin/pod2html: -: cannot resolve L<guestfs(3)/INSPECTION> in paragraph 1420.
/usr/bin/pod2html: -: cannot resolve L<guestfs(3)/INSPECTION> in paragraph 1460.
/usr/bin/pod2html: -: cannot resolve L<guestfs(3)/INSPECTION> in paragraph 1467.
/usr/bin/pod2html: -: cannot resolve L<guestfs(3)/INSPECTION> in paragraph 1476.
/usr/bin/pod2html: -: cannot resolve L<guestfs(3)/INSPECTION> in paragraph 1484.
/usr/bin/pod2html: -: cannot resolve L<guestfs(3)/INSPECTION> in paragraph 1492.
/usr/bin/pod2html: -: cannot resolve L<guestfs(3)/INSPECTION> in paragraph 1499.
/usr/bin/pod2html: -: cannot resolve L<guestfs(3)/INSPECTION> in paragraph 1508.
/usr/bin/pod2html: -: cannot resolve L<guestfs(3)/INSPECTION> in paragraph 1515.
/usr/bin/pod2html: -: cannot resolve L<environ(3)> in paragraph 1516.
/usr/bin/pod2html: -: cannot resolve L<guestfs(3)/INSPECTION> in paragraph 1532.
/usr/bin/pod2html: -: cannot resolve L<guestfs(3)/INSPECTION> in paragraph 1539.
/usr/bin/pod2html: -: cannot resolve L<guestfs(3)/INSPECTION> in paragraph 1546.
/usr/bin/pod2html: -: cannot resolve L<guestfs(3)/INSPECTION> in paragraph 1552.
/usr/bin/pod2html: -: cannot resolve L<guestfs(3)/INSPECTION> in paragraph 1558.
/usr/bin/pod2html: -: cannot resolve L<guestfs(3)/INSPECTION> in paragraph 1564.
/usr/bin/pod2html: -: cannot resolve L<guestfs(3)/INSPECTION> in paragraph 1601.
/usr/bin/pod2html: -: cannot resolve L<guestfs(3)/INSPECTION> in paragraph 1612.
/usr/bin/pod2html: -: cannot resolve L<environ(3)> in paragraph 1614.
/usr/bin/pod2html: -: cannot resolve L<guestfs(3)> in paragraph 1625.
/usr/bin/pod2html: -: cannot resolve L<guestfs(3)> in paragraph 1637.
/usr/bin/pod2html: -: cannot resolve L<guestfs(3)> in paragraph 1661.
/usr/bin/pod2html: -: cannot resolve L<guestfs(3)> in paragraph 1672.
/usr/bin/pod2html: -: cannot resolve L<qemu(1)> in paragraph 1705.
/usr/bin/pod2html: -: cannot resolve L<guestfs(3)/GUESTFS_EVENT_PROGRESS> in paragraph 1708.
/usr/bin/pod2html: -: cannot resolve L<attr(5)> in paragraph 1721.
/usr/bin/pod2html: -: cannot resolve L<environ(3)> in paragraph 1732.
/usr/bin/pod2html: -: cannot resolve L<environ(3)> in paragraph 1739.
/usr/bin/pod2html: -: cannot resolve L<environ(3)> in paragraph 1746.
/usr/bin/pod2html: -: cannot resolve L<environ(3)> in paragraph 1764.
/usr/bin/pod2html: -: cannot resolve L<environ(3)> in paragraph 1801.
/usr/bin/pod2html: -: cannot resolve L<lvs(8)> in paragraph 1927.
/usr/bin/pod2html: -: cannot resolve L<environ(3)> in paragraph 1930.
/usr/bin/pod2html: -: cannot resolve L<lvs(8)> in paragraph 1934.
/usr/bin/pod2html: -: cannot resolve L<mkdtemp(3)> in paragraph 1973.
/usr/bin/pod2html: -: cannot resolve L<mkfs.ufs(8)> in paragraph 2040.
/usr/bin/pod2html: -: cannot resolve L<mke2fs(8)> in paragraph 2043.
/usr/bin/pod2html: -: cannot resolve L<mkfs.ufs(8)> in paragraph 2043.
/usr/bin/pod2html: -: cannot resolve L<mke2fs(8)> in paragraph 2046.
/usr/bin/pod2html: -: cannot resolve L<mkfs.ufs(8)> in paragraph 2048.
/usr/bin/pod2html: -: cannot resolve L<mount(2)> in paragraph 2124.
/usr/bin/pod2html: -: cannot resolve L<mount(8)> in paragraph 2154.
/usr/bin/pod2html: -: cannot resolve L<mount(8)> in paragraph 2165.
/usr/bin/pod2html: -: cannot resolve L<environ(3)> in paragraph 2178.
/usr/bin/pod2html: -: cannot resolve L<ntfs-3g.probe(8)> in paragraph 2187.
/usr/bin/pod2html: -: cannot resolve L<ntfs-3g.probe(8)> in paragraph 2189.
/usr/bin/pod2html: -: cannot resolve L<ntfsresize(8)> in paragraph 2196.
/usr/bin/pod2html: -: cannot resolve L<ntfsresize(8)> in paragraph 2214.
/usr/bin/pod2html: -: cannot resolve L<pread(2)> in paragraph 2352.
/usr/bin/pod2html: -: cannot resolve L<guestfs(3)/PROTOCOL LIMITS> in paragraph 2355.
/usr/bin/pod2html: -: cannot resolve L<pread(2)> in paragraph 2360.
/usr/bin/pod2html: -: cannot resolve L<guestfs(3)/PROTOCOL LIMITS> in paragraph 2363.
/usr/bin/pod2html: -: cannot resolve L<pvs(8)> in paragraph 2388.
/usr/bin/pod2html: -: cannot resolve L<environ(3)> in paragraph 2391.
/usr/bin/pod2html: -: cannot resolve L<pvs(8)> in paragraph 2395.
/usr/bin/pod2html: -: cannot resolve L<pwrite(2)> in paragraph 2406.
/usr/bin/pod2html: -: cannot resolve L<guestfs(3)/PROTOCOL LIMITS> in paragraph 2409.
/usr/bin/pod2html: -: cannot resolve L<pwrite(2)> in paragraph 2414.
/usr/bin/pod2html: -: cannot resolve L<guestfs(3)/PROTOCOL LIMITS> in paragraph 2417.
/usr/bin/pod2html: -: cannot resolve L<guestfs(3)/PROTOCOL LIMITS> in paragraph 2424.
/usr/bin/pod2html: -: cannot resolve L<environ(3)> in paragraph 2431.
/usr/bin/pod2html: -: cannot resolve L<readdir(3)> in paragraph 2456.
/usr/bin/pod2html: -: cannot resolve L<environ(3)> in paragraph 2472.
/usr/bin/pod2html: -: cannot resolve L<attr(5)> in paragraph 2482.
/usr/bin/pod2html: -: cannot resolve L<guestfs(3)/ATTACHING TO RUNNING DAEMONS> in paragraph 2557.
/usr/bin/pod2html: -: cannot resolve L<tune2fs(8)> in paragraph 2583.
/usr/bin/pod2html: -: cannot resolve L<guestfs(3)> in paragraph 2591.
/usr/bin/pod2html: -: cannot resolve L<guestfs(3)/RUNNING COMMANDS> in paragraph 2597.
/usr/bin/pod2html: -: cannot resolve L<guestfs(3)> in paragraph 2634.
/usr/bin/pod2html: -: cannot resolve L<guestfs(3)> in paragraph 2655.
/usr/bin/pod2html: -: cannot resolve L<attr(5)> in paragraph 2661.
/usr/bin/pod2html: -: cannot resolve L<sfdisk(8)> in paragraph 2666.
/usr/bin/pod2html: -: cannot resolve L<sfdisk(8)> in paragraph 2669.
/usr/bin/pod2html: -: cannot resolve L<sfdisk(8)> in paragraph 2680.
/usr/bin/pod2html: -: cannot resolve L<sfdisk(8)> in paragraph 2688.
/usr/bin/pod2html: -: cannot resolve L<sfdisk(8)> in paragraph 2710.
/usr/bin/pod2html: -: cannot resolve L<environ(3)> in paragraph 2729.
/usr/bin/pod2html: -: cannot resolve L<strings(1)> in paragraph 2750.
/usr/bin/pod2html: -: cannot resolve L<environ(3)> in paragraph 2751.
/usr/bin/pod2html: -: cannot resolve L<guestfs(3)/PROTOCOL LIMITS> in paragraph 2752.
/usr/bin/pod2html: -: cannot resolve L<environ(3)> in paragraph 2773.
/usr/bin/pod2html: -: cannot resolve L<guestfs(3)/PROTOCOL LIMITS> in paragraph 2774.
/usr/bin/pod2html: -: cannot resolve L<environ(3)> in paragraph 2826.
/usr/bin/pod2html: -: cannot resolve L<guestfs(3)/PROTOCOL LIMITS> in paragraph 2827.
/usr/bin/pod2html: -: cannot resolve L<environ(3)> in paragraph 2834.
/usr/bin/pod2html: -: cannot resolve L<guestfs(3)/PROTOCOL LIMITS> in paragraph 2835.
/usr/bin/pod2html: -: cannot resolve L<touch(1)> in paragraph 2863.
/usr/bin/pod2html: -: cannot resolve L<tune2fs(8)> in paragraph 2881.
/usr/bin/pod2html: -: cannot resolve L<umask(2)> in paragraph 2899.
/usr/bin/pod2html: -: cannot resolve L<guestfs(3)/GUESTFS_EVENT_PROGRESS> in paragraph 2920.
/usr/bin/pod2html: -: cannot resolve L<guestfs(3)/GUESTFS_EVENT_PROGRESS> in paragraph 2929.
/usr/bin/pod2html: -: cannot resolve L<guestfs(3)/LIBGUESTFS VERSION NUMBERS> in paragraph 2947.
/usr/bin/pod2html: -: cannot resolve L<environ(3)> in paragraph 2994.
/usr/bin/pod2html: -: cannot resolve L<environ(3)> in paragraph 3001.
/usr/bin/pod2html: -: cannot resolve L<vgs(8)> in paragraph 3016.
/usr/bin/pod2html: -: cannot resolve L<environ(3)> in paragraph 3019.
/usr/bin/pod2html: -: cannot resolve L<vgs(8)> in paragraph 3023.
/usr/bin/pod2html: -: cannot resolve L<guestfs(3)/PROTOCOL LIMITS> in paragraph 3065.
/usr/bin/pod2html: -: cannot resolve L<guestfs(3)/PROTOCOL LIMITS> in paragraph 3072.
/usr/bin/pod2html: -: cannot resolve L<guestfs(3)/PROTOCOL LIMITS> in paragraph 3079.
/usr/bin/pod2html: -: cannot resolve L<environ(3)> in paragraph 3086.
/usr/bin/pod2html: -: cannot resolve L<guestfs(3)/PROTOCOL LIMITS> in paragraph 3087.
/usr/bin/pod2html: -: cannot resolve L<environ(3)> in paragraph 3092.
/usr/bin/pod2html: -: cannot resolve L<guestfs(3)/PROTOCOL LIMITS> in paragraph 3093.
/usr/bin/pod2html: -: cannot resolve L<guestfs(3)/GUESTFS_EVENT_PROGRESS> in paragraph 3101.
/usr/bin/pod2html: -: cannot resolve L<guestfs(3)/GUESTFS_EVENT_PROGRESS> in paragraph 3107.
/usr/bin/pod2html: -: cannot resolve L<environ(3)> in paragraph 3120.
/usr/bin/pod2html: -: cannot resolve L<guestfs(3)/PROTOCOL LIMITS> in paragraph 3121.
/usr/bin/pod2html: -: cannot resolve L<environ(3)> in paragraph 3126.
/usr/bin/pod2html: -: cannot resolve L<guestfs(3)/PROTOCOL LIMITS> in paragraph 3127.
/usr/bin/pod2html: -: cannot resolve L<environ(3)> in paragraph 3141.
/usr/bin/pod2html: -: cannot resolve L<guestfs(3)/PROTOCOL LIMITS> in paragraph 3142.
/usr/bin/pod2html: -: cannot resolve L<environ(3)> in paragraph 3147.
/usr/bin/pod2html: -: cannot resolve L<guestfs(3)/PROTOCOL LIMITS> in paragraph 3148.
/usr/bin/pod2html: -: cannot resolve L<guestfish(3)> in paragraph 3213.
/usr/bin/pod2html: -: cannot resolve L<dlopen(3)> in paragraph 3223.
/usr/bin/pod2html: -: cannot resolve L<guestfish(1)/OPTIONAL ARGUMENTS> in paragraph 3256.
/usr/bin/pod2html: -: cannot resolve L<atexit(3)> in paragraph 3266.
/usr/bin/pod2html: -: cannot resolve L<exit(3)> in paragraph 3266.
/usr/bin/pod2html: -: cannot resolve L<qemu(1)> in paragraph 3383.
/usr/bin/pod2html: -: cannot resolve L<rjones redhat com> in paragraph 3522.
/usr/bin/pod2html: -: cannot resolve L<virt-filesystems(1)> in paragraph 3534.
/usr/bin/pod2html: -: cannot resolve L<virt-ls(1)> in paragraph 3534.
/usr/bin/pod2html: -: cannot resolve L<guestfish(1)> in paragraph 3548.
/usr/bin/pod2html: -: cannot resolve L<virt-copy-in(1)> in paragraph 3548.
/usr/bin/pod2html: -: cannot resolve L<virt-copy-out(1)> in paragraph 3548.
/usr/bin/pod2html: -: cannot resolve L<virt-tar-in(1)> in paragraph 3548.
/usr/bin/pod2html: -: cannot resolve L<virt-tar-out(1)> in paragraph 3548.
/usr/bin/pod2html: -: cannot resolve L<guestmount(1)> in paragraph 3550.
/usr/bin/pod2html: -: cannot resolve L<virt-resize(1)> in paragraph 3573.
/usr/bin/pod2html: -: cannot resolve L<guestmount(1)> in paragraph 3591.
/usr/bin/pod2html: -: cannot resolve L<guestfish(1)> in paragraph 3636.
/usr/bin/pod2html: -: cannot resolve L<guestmount(1)> in paragraph 3636.
/usr/bin/pod2html: -: cannot resolve L<virt-copy-in(1)> in paragraph 3636.
/usr/bin/pod2html: -: cannot resolve L<virt-copy-out(1)> in paragraph 3636.
/usr/bin/pod2html: -: cannot resolve L<virt-filesystems(1)> in paragraph 3636.
/usr/bin/pod2html: -: cannot resolve L<virt-list-filesystems(1)> in paragraph 3636.
/usr/bin/pod2html: -: cannot resolve L<virt-list-partitions(1)> in paragraph 3636.
/usr/bin/pod2html: -: cannot resolve L<virt-ls(1)> in paragraph 3636.
/usr/bin/pod2html: -: cannot resolve L<virt-make-fs(1)> in paragraph 3636.
/usr/bin/pod2html: -: cannot resolve L<virt-tar(1)> in paragraph 3636.
/usr/bin/pod2html: -: cannot resolve L<virt-tar-in(1)> in paragraph 3636.
/usr/bin/pod2html: -: cannot resolve L<virt-tar-out(1)> in paragraph 3636.
/usr/bin/pod2html: -: cannot resolve L<virt-win-reg(1)> in paragraph 3636.
/usr/bin/pod2html: -: cannot resolve L<qemu(1)> in paragraph 3636.
/usr/bin/pod2html: -: cannot resolve L<febootstrap(1)> in paragraph 3636.
/usr/bin/pod2html: -: cannot resolve L<hivex(3)> in paragraph 3636.
/usr/bin/pod2html: -: cannot resolve L<fdisk(8)> in paragraph 3637.
/usr/bin/pod2html: -: cannot resolve L<parted(8)> in paragraph 3637.
/usr/bin/pod2html: -: cannot resolve L<kpartx(8)> in paragraph 3637.
/usr/bin/pod2html: -: cannot resolve L<lvm(8)> in paragraph 3637.
/usr/bin/pod2html: -: cannot resolve L<disktype(1)> in paragraph 3637.
sed -e 's,<em>guestfs(3)</em>,<a href=guestfs.3.html>guestfs(3)</a>,g'
touch stamp-guestfs.pod
make[3]: Leaving directory `/home/rjones/d/libguestfs/src'
make[2]: Leaving directory `/home/rjones/d/libguestfs/src'
Making all in examples
make[2]: Entering directory `/home/rjones/d/libguestfs/examples'
  CC     create_disk-create_disk.o
  CCLD   create_disk
  CC     inspect_vm-inspect_vm.o
  CCLD   inspect_vm
  CC     virt_dhcp_address-virt-dhcp-address.o
  CCLD   virt-dhcp-address
../podwrapper.sh \
	  --section 3 \
	  --man guestfs-examples.3 \
	  --html ../html/guestfs-examples.3.html \
	  --verbatim create_disk.c:@EXAMPLE1@ \
	  --verbatim inspect_vm.c:@EXAMPLE2@ \
	  guestfs-examples.pod
/usr/bin/pod2html: -: unknown pod directive 'encoding' in paragraph 1.  ignoring.
/usr/bin/pod2html: -: cannot resolve L<guestfs(3)> in paragraph 8.
/usr/bin/pod2html: -: cannot resolve L<guestfs(3)> in paragraph 14.
/usr/bin/pod2html: -: cannot resolve L<guestfs-ocaml(3)> in paragraph 14.
/usr/bin/pod2html: -: cannot resolve L<guestfs-perl(3)> in paragraph 14.
/usr/bin/pod2html: -: cannot resolve L<guestfs-python(3)> in paragraph 14.
/usr/bin/pod2html: -: cannot resolve L<guestfs-recipes(1)> in paragraph 14.
/usr/bin/pod2html: -: cannot resolve L<guestfs-ruby(3)> in paragraph 14.
sed -e 's,<em>guestfs-examples(3)</em>,<a href=guestfs-examples.3.html>guestfs-examples(3)</a>,g' -e 's,<em>guestfs(3)</em>,<a href=guestfs.3.html>guestfs(3)</a>,g'
touch stamp-guestfs-examples.pod
../podwrapper.sh \
	  --section 1 \
	  --man guestfs-recipes.1 \
	  --html ../html/guestfs-recipes.1.html \
	  guestfs-recipes.pod
/usr/bin/pod2html: -: unknown pod directive 'encoding' in paragraph 1.  ignoring.
/usr/bin/pod2html: -: cannot resolve L<guestfish(1)> in paragraph 9.
/usr/bin/pod2html: -: cannot resolve L<guestfish(1)> in paragraph 14.
/usr/bin/pod2html: -: cannot resolve L<virt-clone(1)> in paragraph 19.
/usr/bin/pod2html: -: cannot resolve L<guestfish(1)> in paragraph 30.
/usr/bin/pod2html: -: cannot resolve L<guestfish(1)> in paragraph 33.
/usr/bin/pod2html: -: cannot resolve L<virt-filesystems(1)> in paragraph 36.
/usr/bin/pod2html: -: cannot resolve L<virt-edit(1)> in paragraph 47.
/usr/bin/pod2html: -: cannot resolve L<virt-rescue(1)> in paragraph 49.
/usr/bin/pod2html: -: cannot resolve L<virt-copy-out(1)> in paragraph 52.
/usr/bin/pod2html: -: cannot resolve L<virt-inspector(1)> in paragraph 78.
/usr/bin/pod2html: -: cannot resolve L<virt-inspector(1)> in paragraph 105.
/usr/bin/pod2html: -: cannot resolve L<guestfish(1)> in paragraph 107.
/usr/bin/pod2html: -: cannot resolve L<virt-df(1)> in paragraph 116.
/usr/bin/pod2html: -: cannot resolve L<guestfish(1)> in paragraph 119.
/usr/bin/pod2html: -: cannot resolve L<virt-edit(1)> in paragraph 122.
/usr/bin/pod2html: -: cannot resolve L<guestfish(1)> in paragraph 128.
/usr/bin/pod2html: -: cannot resolve L<guestfish(1)> in paragraph 134.
/usr/bin/pod2html: -: cannot resolve L<guestfs(3)> in paragraph 137.
/usr/bin/pod2html: -: cannot resolve L<guestfish(1)> in paragraph 137.
/usr/bin/pod2html: -: cannot resolve L<guestfs-examples(3)> in paragraph 137.
/usr/bin/pod2html: -: cannot resolve L<guestfs-ocaml(3)> in paragraph 137.
/usr/bin/pod2html: -: cannot resolve L<guestfs-perl(3)> in paragraph 137.
/usr/bin/pod2html: -: cannot resolve L<guestfs-python(3)> in paragraph 137.
/usr/bin/pod2html: -: cannot resolve L<guestfs-ruby(3)> in paragraph 137.
sed -e 's,<em>guestfs-examples(3)</em>,<a href=guestfs-examples.3.html>guestfs-examples(3)</a>,g' -e 's,<em>guestfs-recipes(1)</em>,<a href=guestfs-recipes.1.html>guestfs-recipes(1)</a>,g' -e 's,<em>guestfs(3)</em>,<a href=guestfs.3.html>guestfs(3)</a>,g'
touch stamp-guestfs-recipes.pod
make[2]: Leaving directory `/home/rjones/d/libguestfs/examples'
Making all in po
make[2]: Entering directory `/home/rjones/d/libguestfs/po'
test ! -f ./libguestfs.pot || \
	  test -z "es.gmo gu.gmo hi.gmo kn.gmo ml.gmo mr.gmo nl.gmo or.gmo pa.gmo pl.gmo ta.gmo te.gmo uk.gmo" || make es.gmo gu.gmo hi.gmo kn.gmo ml.gmo mr.gmo nl.gmo or.gmo pa.gmo pl.gmo ta.gmo te.gmo uk.gmo
make[3]: Entering directory `/home/rjones/d/libguestfs/po'
rm -f es.gmo && /usr/bin/msgfmt -c --statistics --verbose -o es.gmo es.po
es.po: 497 translated messages, 84 fuzzy translations, 44 untranslated messages.
rm -f gu.gmo && /usr/bin/msgfmt -c --statistics --verbose -o gu.gmo gu.po
gu.po: 315 translated messages, 129 fuzzy translations, 181 untranslated messages.
rm -f hi.gmo && /usr/bin/msgfmt -c --statistics --verbose -o hi.gmo hi.po
hi.po: 318 translated messages, 131 fuzzy translations, 176 untranslated messages.
rm -f kn.gmo && /usr/bin/msgfmt -c --statistics --verbose -o kn.gmo kn.po
kn.po: 317 translated messages, 132 fuzzy translations, 176 untranslated messages.
rm -f ml.gmo && /usr/bin/msgfmt -c --statistics --verbose -o ml.gmo ml.po
ml.po: 312 translated messages, 132 fuzzy translations, 181 untranslated messages.
rm -f mr.gmo && /usr/bin/msgfmt -c --statistics --verbose -o mr.gmo mr.po
mr.po: 315 translated messages, 131 fuzzy translations, 179 untranslated messages.
rm -f nl.gmo && /usr/bin/msgfmt -c --statistics --verbose -o nl.gmo nl.po
nl.po: 451 translated messages, 112 fuzzy translations, 62 untranslated messages.
rm -f or.gmo && /usr/bin/msgfmt -c --statistics --verbose -o or.gmo or.po
or.po: 315 translated messages, 129 fuzzy translations, 181 untranslated messages.
rm -f pa.gmo && /usr/bin/msgfmt -c --statistics --verbose -o pa.gmo pa.po
pa.po: 563 translated messages, 39 fuzzy translations, 23 untranslated messages.
rm -f pl.gmo && /usr/bin/msgfmt -c --statistics --verbose -o pl.gmo pl.po
pl.po: 564 translated messages, 39 fuzzy translations, 22 untranslated messages.
rm -f ta.gmo && /usr/bin/msgfmt -c --statistics --verbose -o ta.gmo ta.po
ta.po: 310 translated messages, 131 fuzzy translations, 184 untranslated messages.
rm -f te.gmo && /usr/bin/msgfmt -c --statistics --verbose -o te.gmo te.po
te.po: 310 translated messages, 131 fuzzy translations, 184 untranslated messages.
rm -f uk.gmo && /usr/bin/msgfmt -c --statistics --verbose -o uk.gmo uk.po
uk.po: 579 translated messages, 31 fuzzy translations, 15 untranslated messages.
make[3]: Leaving directory `/home/rjones/d/libguestfs/po'
touch stamp-po
make[2]: Leaving directory `/home/rjones/d/libguestfs/po'
Making all in daemon
make[2]: Entering directory `/home/rjones/d/libguestfs/daemon'
make -C ./../generator stamp-generator
make[3]: Entering directory `/home/rjones/d/libguestfs/generator'
make[3]: `stamp-generator' is up to date.
make[3]: Leaving directory `/home/rjones/d/libguestfs/generator'
make -C ./../src guestfs_protocol.c
make[3]: Entering directory `/home/rjones/d/libguestfs/src'
make -C ../generator stamp-generator
make[4]: Entering directory `/home/rjones/d/libguestfs/generator'
make[4]: `stamp-generator' is up to date.
make[4]: Leaving directory `/home/rjones/d/libguestfs/generator'
make[3]: Leaving directory `/home/rjones/d/libguestfs/src'
rm -f guestfs_protocol.c
ln ../src/guestfs_protocol.c guestfs_protocol.c
make -C ./../src guestfs_protocol.h
make[3]: Entering directory `/home/rjones/d/libguestfs/src'
make -C ../generator stamp-generator
make[4]: Entering directory `/home/rjones/d/libguestfs/generator'
make[4]: `stamp-generator' is up to date.
make[4]: Leaving directory `/home/rjones/d/libguestfs/generator'
make[3]: Leaving directory `/home/rjones/d/libguestfs/src'
rm -f guestfs_protocol.h
ln ../src/guestfs_protocol.h guestfs_protocol.h
(CDPATH="${ZSH_VERSION+.}:" && cd . && /bin/sh /home/rjones/d/libguestfs/daemon/build-aux/missing --run autoheader)
rm -f stamp-h1
touch config.h.in
cd . && /bin/sh ./config.status config.h
config.status: creating config.h
config.status: config.h is unchanged
make  all-recursive
make[3]: Entering directory `/home/rjones/d/libguestfs/daemon'
Making all in lib
make[4]: Entering directory `/home/rjones/d/libguestfs/daemon/lib'
  GEN    alloca.h
  GEN    arg-nonnull.h
  GEN    c++defs.h
  GEN    warn-on-use.h
  GEN    arpa/inet.h
  GEN    configmake.h
  GEN    dirent.h
  GEN    fcntl.h
  GEN    fnmatch.h
  GEN    glob.h
  GEN    netdb.h
  GEN    stdio.h
  GEN    stdlib.h
  GEN    string.h
  GEN    sys/select.h
  GEN    sys/socket.h
  GEN    sys/stat.h
  GEN    sys/time.h
  GEN    sys/uio.h
  GEN    sys/wait.h
  GEN    time.h
  GEN    unistd.h
  GEN    wchar.h
  GEN    wctype.h
make  all-recursive
make[5]: Entering directory `/home/rjones/d/libguestfs/daemon/lib'
make[6]: Entering directory `/home/rjones/d/libguestfs/daemon/lib'
  CC     c-ctype.o
  CC     exitfail.o
  CC     fd-hook.o
  CC     freading.o
  CC     full-read.o
  CC     localcharset.o
  CC     glthread/lock.o
  CC     openat-die.o
  CC     sockets.o
  CC     strnlen1.o
  CC     glthread/threadlib.o
  CC     asnprintf.o
  CC     basename-lgpl.o
  CC     chdir-long.o
  CC     cloexec.o
  CC     dirname-lgpl.o
  CC     dup-safer.o
  CC     fclose.o
  CC     fcntl.o
  CC     fd-safer.o
  CC     fflush.o
  CC     filenamecat-lgpl.o
  CC     fnmatch.o
  CC     fpurge.o
  CC     fseeko.o
  CC     fsusage.o
  CC     futimens.o
  CC     gettime.o
  CC     glob.o
  CC     hash.o
  CC     openat-proc.o
  CC     pipe-safer.o
  CC     printf-args.o
  CC     printf-parse.o
  CC     read-file.o
  CC     safe-read.o
  CC     save-cwd.o
  CC     strerror_r.o
  CC     stripslash.o
  CC     tempname.o
  CC     utimens.o
  CC     vasnprintf.o
  AR     libgnu.a
  GEN    charset.alias
  GEN    ref-add.sed
  GEN    ref-del.sed
make[6]: Leaving directory `/home/rjones/d/libguestfs/daemon/lib'
make[5]: Leaving directory `/home/rjones/d/libguestfs/daemon/lib'
make[4]: Leaving directory `/home/rjones/d/libguestfs/daemon/lib'
Making all in tests
make[4]: Entering directory `/home/rjones/d/libguestfs/daemon/tests'
  GEN    arg-nonnull.h
  GEN    c++defs.h
  GEN    warn-on-use.h
  GEN    inttypes.h
  GEN    locale.h
  GEN    sys/ioctl.h
make  all-recursive
make[5]: Entering directory `/home/rjones/d/libguestfs/daemon/tests'
Making all in .
make[6]: Entering directory `/home/rjones/d/libguestfs/daemon/tests'
make[6]: Nothing to be done for `all-am'.
make[6]: Leaving directory `/home/rjones/d/libguestfs/daemon/tests'
make[5]: Leaving directory `/home/rjones/d/libguestfs/daemon/tests'
make[4]: Leaving directory `/home/rjones/d/libguestfs/daemon/tests'
Making all in .
make[4]: Entering directory `/home/rjones/d/libguestfs/daemon'
make -C ./../src guestfs_protocol.c
make[5]: Entering directory `/home/rjones/d/libguestfs/src'
make -C ../generator stamp-generator
make[6]: Entering directory `/home/rjones/d/libguestfs/generator'
make[6]: `stamp-generator' is up to date.
make[6]: Leaving directory `/home/rjones/d/libguestfs/generator'
make[5]: Leaving directory `/home/rjones/d/libguestfs/src'
make -C ./../src guestfs_protocol.h
make[5]: Entering directory `/home/rjones/d/libguestfs/src'
make -C ../generator stamp-generator
make[6]: Entering directory `/home/rjones/d/libguestfs/generator'
make[6]: `stamp-generator' is up to date.
make[6]: Leaving directory `/home/rjones/d/libguestfs/generator'
make[5]: Leaving directory `/home/rjones/d/libguestfs/src'
  CC     libprotocol_a-guestfs_protocol.o
  AR     libprotocol.a
  CC     liberrnostring_a-errnostring_gperf.o
  CC     liberrnostring_a-errnostring.o
  AR     liberrnostring.a
make -C ./../generator stamp-generator
make[5]: Entering directory `/home/rjones/d/libguestfs/generator'
make[5]: `stamp-generator' is up to date.
make[5]: Leaving directory `/home/rjones/d/libguestfs/generator'
  CC     guestfsd-9p.o
  CC     guestfsd-available.o
  CC     guestfsd-augeas.o
  CC     guestfsd-base64.o
  CC     guestfsd-blkid.o
  CC     guestfsd-blockdev.o
  CC     guestfsd-btrfs.o
  CC     guestfsd-checksum.o
  CC     guestfsd-cmp.o
  CC     guestfsd-command.o
  CC     guestfsd-cpmv.o
  CC     guestfsd-dd.o
  CC     guestfsd-debug.o
  CC     guestfsd-devsparts.o
  CC     guestfsd-df.o
  CC     guestfsd-dir.o
  CC     guestfsd-dmesg.o
  CC     guestfsd-dropcaches.o
  CC     guestfsd-du.o
  CC     guestfsd-echo_daemon.o
  CC     guestfsd-ext2.o
  CC     guestfsd-fallocate.o
  CC     guestfsd-file.o
  CC     guestfsd-findfs.o
  CC     guestfsd-fill.o
  CC     guestfsd-find.o
  CC     guestfsd-fsck.o
  CC     guestfsd-glob.o
  CC     guestfsd-grep.o
  CC     guestfsd-grub.o
  CC     guestfsd-guestfsd.o
  CC     guestfsd-headtail.o
  CC     guestfsd-hexdump.o
  CC     guestfsd-htonl.o
  CC     guestfsd-initrd.o
  CC     guestfsd-inotify.o
  CC     guestfsd-is.o
  CC     guestfsd-link.o
  CC     guestfsd-ls.o
  CC     guestfsd-luks.o
  CC     guestfsd-lvm.o
  CC     guestfsd-lvm-filter.o
  CC     guestfsd-mkfs.o
  CC     guestfsd-mknod.o
  CC     guestfsd-modprobe.o
  CC     guestfsd-mount.o
  CC     guestfsd-names.o
  CC     guestfsd-ntfs.o
  CC     guestfsd-optgroups.o
  CC     guestfsd-parted.o
  CC     guestfsd-pingdaemon.o
  CC     guestfsd-proto.o
  CC     guestfsd-readdir.o
  CC     guestfsd-realpath.o
  CC     guestfsd-scrub.o
  CC     guestfsd-selinux.o
  CC     guestfsd-sfdisk.o
  CC     guestfsd-sleep.o
  CC     guestfsd-stat.o
  CC     guestfsd-statvfs.o
  CC     guestfsd-strings.o
  CC     guestfsd-stubs.o
  CC     guestfsd-swap.o
  CC     guestfsd-sync.o
  CC     guestfsd-tar.o
  CC     guestfsd-truncate.o
  CC     guestfsd-umask.o
  CC     guestfsd-upload.o
  CC     guestfsd-utimens.o
  CC     guestfsd-wc.o
  CC     guestfsd-xattr.o
  CC     guestfsd-zero.o
  CC     guestfsd-zerofree.o
  CCLD   guestfsd
make[4]: Leaving directory `/home/rjones/d/libguestfs/daemon'
make[3]: Leaving directory `/home/rjones/d/libguestfs/daemon'
make[2]: Leaving directory `/home/rjones/d/libguestfs/daemon'
Making all in appliance
make[2]: Entering directory `/home/rjones/d/libguestfs/appliance'
cpp -undef -DDEBIAN=1 < packagelist.in | \
	grep -v '^[[:space:]]*$' | grep -v '^#' > packagelist-t
mv packagelist-t packagelist
cpp -undef -DDEBIAN=1 < excludelist.in | \
	grep -v '^[[:space:]]*$' | grep -v '^#' > excludelist-t
mv excludelist-t excludelist
mkdir -p supermin.d
rm -f stamp-supermin supermin.d/base.img supermin.d/hostfiles
./make.sh
febootstrap -v -o supermin.d --names bsdmainutils btrfs-tools cryptsetup diff e2fsprogs gfs-tools gfs2-tools grub-pc hfsplus iproute libaugeas0 linux-image nilfs-tools ntfs-3g ntfsprogs reiserfsprogs udev ufsutils util-linux vim-tiny xz-utils zfs-fuse acl attr bash binutils coreutils cpio dosfstools file findutils grep gzip jfsutils lsof lvm2 module-init-tools net-tools parted procps scrub strace tar xfsprogs zerofree --exclude ^perl --exclude ^python --exclude ^plymouth --exclude ^linux-firmware --exclude ^kbd-misc --exclude ^file-rc
registering package handler: yum-rpm
registering package handler: debian
registering package handler: pacman
febootstrap 3.6
selected package handler: debian
Reading package lists...
Building dependency tree...
Reading state information...
Reading extended state information...
Initializing package states...
Reading task descriptions...
Get:1 http://ftp.uk.debian.org/debian/ lenny/main hfsplus amd64 1.0.4-12 [53.7 kB]
Get:2 http://ftp.uk.debian.org/debian/ lenny/main libhfsp0 amd64 1.0.4-12 [40.1 kB]
Get:3 http://ftp.uk.debian.org/debian/ unstable/main acl amd64 2.2.51-2 [69.7 kB]
Get:4 http://ftp.uk.debian.org/debian/ unstable/main libacl1 amd64 2.2.51-2 [30.3 kB]
Get:5 http://ftp.uk.debian.org/debian/ unstable/main attr amd64 1:2.4.46-2 [51.0 kB]
Get:6 http://ftp.uk.debian.org/debian/ unstable/main libattr1 amd64 1:2.4.46-2 [19.6 kB]
Get:7 http://ftp.uk.debian.org/debian/ unstable/main libaugeas0 amd64 0.8.1-2 [175 kB]
Get:8 http://ftp.uk.debian.org/debian/ unstable/main augeas-lenses all 0.8.1-2 [161 kB]
Get:9 http://ftp.uk.debian.org/debian/ unstable/main bash amd64 4.1-3 [1325 kB]
Get:10 http://ftp.uk.debian.org/debian/ unstable/main base-files amd64 6.4 [69.1 kB]
Get:11 http://ftp.uk.debian.org/debian/ unstable/main binutils amd64 2.21.52.20110707-1 [4800 kB]
Get:12 http://ftp.uk.debian.org/debian/ unstable/main bsdmainutils amd64 8.2.3 [208 kB]
Get:13 http://ftp.uk.debian.org/debian/ unstable/main btrfs-tools amd64 0.19+20100601-3 [664 kB]
Get:14 http://ftp.uk.debian.org/debian/ unstable/main coreutils amd64 8.5-1 [5102 kB]
Get:15 http://ftp.uk.debian.org/debian/ unstable/main cpio amd64 2.11-7 [273 kB]
Get:16 http://ftp.uk.debian.org/debian/ unstable/main cryptsetup amd64 2:1.3.0-3 [188 kB]
Get:17 http://ftp.uk.debian.org/debian/ unstable/main cdebconf amd64 0.156 [168 kB]
Get:18 http://ftp.uk.debian.org/debian/ unstable/main libcryptsetup1 amd64 2:1.3.0-3 [88.6 kB]
Get:19 http://ftp.uk.debian.org/debian/ unstable/main dash amd64 0.5.5.1-7.4 [108 kB]
Get:20 http://ftp.uk.debian.org/debian/ unstable/main debconf all 1.5.40 [168 kB]
Get:21 http://ftp.uk.debian.org/debian/ unstable/main debianutils amd64 4.0.2 [75.7 kB]
Get:22 http://ftp.uk.debian.org/debian/ unstable/main diff all 1:3.0-1 [6490 B]
Get:23 http://ftp.uk.debian.org/debian/ unstable/main diffutils amd64 1:3.0-1 [361 kB]
Get:24 http://ftp.uk.debian.org/debian/ unstable/main dosfstools amd64 3.0.9-1 [92.2 kB]
Get:25 http://ftp.uk.debian.org/debian/ unstable/main dpkg amd64 1.16.0.3 [2227 kB]
Get:26 http://ftp.uk.debian.org/debian/ unstable/main libbz2-1.0 amd64 1.0.5-6 [46.4 kB]
Get:27 http://ftp.uk.debian.org/debian/ unstable/main e2fslibs amd64 1.42~WIP-2011-07-02-1 [164 kB]
Get:28 http://ftp.uk.debian.org/debian/ unstable/main e2fsprogs amd64 1.42~WIP-2011-07-02-1 [854 kB]
Get:29 http://ftp.uk.debian.org/debian/ unstable/main libcomerr2 amd64 1.42~WIP-2011-07-02-1 [51.4 kB]
Get:30 http://ftp.uk.debian.org/debian/ unstable/main libss2 amd64 1.42~WIP-2011-07-02-1 [56.7 kB]
Get:31 http://ftp.uk.debian.org/debian/ unstable/main libc6 amd64 2.13-10 [4316 kB]
Get:32 http://ftp.uk.debian.org/debian/ unstable/main libc-bin amd64 2.13-10 [1082 kB]
Get:33 http://ftp.uk.debian.org/debian/ unstable/main multiarch-support amd64 2.13-10 [138 kB]
Get:34 http://ftp.uk.debian.org/debian/ unstable/main file amd64 5.04-5+b1 [49.8 kB]
Get:35 http://ftp.uk.debian.org/debian/ unstable/main libmagic1 amd64 5.04-5+b1 [233 kB]
Get:36 http://ftp.uk.debian.org/debian/ unstable/main findutils amd64 4.4.2-1+b1 [689 kB]
Get:37 http://ftp.uk.debian.org/debian/ unstable/main gawk amd64 1:3.1.7.dfsg-5 [806 kB]
Err http://ftp.uk.debian.org/debian/ unstable/main libgcc1 amd64 1:4.6.1-2
  404  Not Found [IP: 192.168.0.128 3128]
Err http://ftp.uk.debian.org/debian/ unstable/main gcc-4.6-base amd64 4.6.1-2
  404  Not Found [IP: 192.168.0.128 3128]
Err http://ftp.uk.debian.org/debian/ unstable/main libstdc++6 amd64 4.6.1-2
  404  Not Found [IP: 192.168.0.128 3128]
Get:38 http://ftp.uk.debian.org/debian/ unstable/main grep amd64 2.8-2 [380 kB]
Get:39 http://ftp.uk.debian.org/debian/ unstable/main grub-pc amd64 1.99-8 [92.4 kB]
Get:40 http://ftp.uk.debian.org/debian/ unstable/main grub-common amd64 1.99-8 [2554 kB]
Get:41 http://ftp.uk.debian.org/debian/ unstable/main libfreetype6 amd64 2.4.4-2 [414 kB]
Get:42 http://ftp.uk.debian.org/debian/ unstable/main libfuse2 amd64 2.8.5-3 [143 kB]
Get:43 http://ftp.uk.debian.org/debian/ unstable/main gettext-base amd64 0.18.1.1-3 [153 kB]
Get:44 http://ftp.uk.debian.org/debian/ unstable/main grub-pc-bin amd64 1.99-8 [815 kB]
Get:45 http://ftp.uk.debian.org/debian/ unstable/main grub2-common amd64 1.99-8 [94.0 kB]
Get:46 http://ftp.uk.debian.org/debian/ unstable/main gzip amd64 1.3.12-9 [108 kB]
Get:47 http://ftp.uk.debian.org/debian/ unstable/main iproute amd64 20110629-1 [436 kB]
Get:48 http://ftp.uk.debian.org/debian/ unstable/main libdb5.1 amd64 5.1.25-11 [715 kB]
Get:49 http://ftp.uk.debian.org/debian/ unstable/main jfsutils amd64 1.1.12-2.1 [278 kB]
Get:50 http://ftp.uk.debian.org/debian/ unstable/main libdebian-installer4 amd64 0.78 [32.3 kB]
Get:51 http://ftp.uk.debian.org/debian/ unstable/main libgcrypt11 amd64 1.4.6-7 [285 kB]
Get:52 http://ftp.uk.debian.org/debian/ unstable/main libgpg-error0 amd64 1.10-0.3 [68.7 kB]
Get:53 http://ftp.uk.debian.org/debian/ unstable/main libselinux1 amd64 2.0.98-1.1 [89.0 kB]
Get:54 http://ftp.uk.debian.org/debian/ unstable/main libtextwrap1 amd64 0.1-12 [11.7 kB]
Get:55 http://ftp.uk.debian.org/debian/ unstable/main ntfsprogs amd64 2.0.0-1+b1 [264 kB]
Get:56 http://ftp.uk.debian.org/debian/ unstable/main fuse-utils all 2.8.5-3 [38.8 kB]
Get:57 http://ftp.uk.debian.org/debian/ unstable/main fuse amd64 2.8.5-3 [67.6 kB]
Get:58 http://ftp.uk.debian.org/debian/ unstable/main adduser all 3.113 [218 kB]
Get:59 http://ftp.uk.debian.org/debian/ unstable/main libntfs10 amd64 2.0.0-1+b1 [117 kB]
Get:60 http://ftp.uk.debian.org/debian/ unstable/main lsof amd64 4.81.dfsg.1-1 [282 kB]
Get:61 http://ftp.uk.debian.org/debian/ unstable/main dmsetup amd64 2:1.02.63-3 [60.0 kB]
Get:62 http://ftp.uk.debian.org/debian/ unstable/main libdevmapper1.02.1 amd64 2:1.02.63-3 [95.7 kB]
Get:63 http://ftp.uk.debian.org/debian/ unstable/main lvm2 amd64 2.02.84-3 [502 kB]
Get:64 http://ftp.uk.debian.org/debian/ unstable/main lsb-base all 3.2-27 [21.1 kB]
Get:65 http://ftp.uk.debian.org/debian/ unstable/main makedev all 2.3.1-89 [42.4 kB]
Get:66 http://ftp.uk.debian.org/debian/ unstable/main base-passwd amd64 3.5.22 [41.9 kB]
Get:67 http://ftp.uk.debian.org/debian/ unstable/main mawk amd64 1.3.3-15 [90.1 kB]
Get:68 http://ftp.uk.debian.org/debian/ unstable/main module-init-tools amd64 3.16-1 [115 kB]
Get:69 http://ftp.uk.debian.org/debian/ unstable/main libncurses5 amd64 5.9-1 [382 kB]
Get:70 http://ftp.uk.debian.org/debian/ unstable/main ncurses-bin amd64 5.9-1 [333 kB]
Get:71 http://ftp.uk.debian.org/debian/ unstable/main net-tools amd64 1.60-24 [339 kB]
Get:72 http://ftp.uk.debian.org/debian/ unstable/main libnewt0.52 amd64 0.52.11-2.1 [73.2 kB]
Get:73 http://ftp.uk.debian.org/debian/ unstable/main nilfs-tools amd64 2.0.23-1 [119 kB]
Err http://ftp.uk.debian.org/debian/ unstable/main ntfs-3g amd64 1:2011.4.12AR.3-2
  404  Not Found [IP: 192.168.0.128 3128]
Get:74 http://ftp.uk.debian.org/debian/ unstable/main original-awk amd64 2011-05-06-1 [73.7 kB]
Get:75 http://ftp.uk.debian.org/debian/ unstable/main parted amd64 2.3-6 [157 kB]
Get:76 http://ftp.uk.debian.org/debian/ unstable/main libparted0debian1 amd64 2.3-6 [343 kB]
Get:77 http://ftp.uk.debian.org/debian/ unstable/main libpopt0 amd64 1.16-1 [54.1 kB]
Get:78 http://ftp.uk.debian.org/debian/ unstable/main procps amd64 1:3.2.8-10 [249 kB]
Get:79 http://ftp.uk.debian.org/debian/ unstable/main libncursesw5 amd64 5.9-1 [405 kB]
Get:80 http://ftp.uk.debian.org/debian/ unstable/main libreadline5 amd64 5.2-8 [151 kB]
Get:81 http://ftp.uk.debian.org/debian/ unstable/main libreadline6 amd64 6.2-2 [164 kB]
Get:82 http://ftp.uk.debian.org/debian/ unstable/main readline-common all 6.2-2 [54.8 kB]
Get:83 http://ftp.uk.debian.org/debian/ unstable/main gfs-tools amd64 3.0.12-2+b1 [212 kB]
Get:84 http://ftp.uk.debian.org/debian/ unstable/main libxml2 amd64 2.7.8.dfsg-3 [890 kB]
Get:85 http://ftp.uk.debian.org/debian/ unstable/main libldap-2.4-2 amd64 2.4.25-1.1 [219 kB]
Get:86 http://ftp.uk.debian.org/debian/ unstable/main libsasl2-2 amd64 2.1.24~rc1.dfsg1+cvs2011-05-23-4 [119 kB]
Get:87 http://ftp.uk.debian.org/debian/ unstable/main libgnutls26 amd64 2.10.5-2 [619 kB]
Get:88 http://ftp.uk.debian.org/debian/ unstable/main libtasn1-3 amd64 2.9-4 [63.9 kB]
Get:89 http://ftp.uk.debian.org/debian/ unstable/main gfs2-tools amd64 3.0.12-2+b1 [326 kB]
Get:90 http://ftp.uk.debian.org/debian/ unstable/main psmisc amd64 22.14-1 [118 kB]
Get:91 http://ftp.uk.debian.org/debian/ unstable/main cman amd64 3.0.12-2+b1 [625 kB]
Get:92 http://ftp.uk.debian.org/debian/ lenny/main libnet-telnet-perl all 3.03-3 [52.0 kB]
Get:93 http://ftp.uk.debian.org/debian/ lenny/main telnet amd64 0.17-36 [71.8 kB]
Get:94 http://ftp.uk.debian.org/debian/ unstable/main corosync amd64 1.3.0-3 [370 kB]
Get:95 http://ftp.uk.debian.org/debian/ unstable/main libcorosync4 amd64 1.3.0-3 [291 kB]
Get:96 http://ftp.uk.debian.org/debian/ unstable/main libnet-snmp-perl all 6.0.1-1 [114 kB]
Err http://ftp.uk.debian.org/debian/ unstable/main libvirt0 amd64 0.9.2-6
  404  Not Found [IP: 192.168.0.128 3128]
Get:97 http://ftp.uk.debian.org/debian/ unstable/main libcap-ng0 amd64 0.6.6-1 [12.5 kB]
Get:98 http://ftp.uk.debian.org/debian/ unstable/main libnl1 amd64 1.1-7 [142 kB]
Get:99 http://ftp.uk.debian.org/debian/ unstable/main libxml2-utils amd64 2.7.8.dfsg-3 [92.7 kB]
Get:100 http://ftp.uk.debian.org/debian/ unstable/main snmp amd64 5.4.3~dfsg-2.2 [1051 kB]
Get:101 http://ftp.uk.debian.org/debian/ unstable/main libsnmp15 amd64 5.4.3~dfsg-2.2 [2255 kB]
Get:102 http://ftp.uk.debian.org/debian/ unstable/main libsensors4 amd64 1:3.3.0-4 [53.9 kB]
Get:103 http://ftp.uk.debian.org/debian/ unstable/main libsnmp-base all 5.4.3~dfsg-2.2 [1100 kB]
Get:104 http://ftp.uk.debian.org/debian/ unstable/main netbase all 4.46 [21.0 kB]
Get:105 http://ftp.uk.debian.org/debian/ unstable/main libnspr4-0d amd64 4.8.8-2 [142 kB]
Get:106 http://ftp.uk.debian.org/debian/ unstable/main libnss3-1d amd64 3.12.10-2 [1136 kB]
Get:107 http://ftp.uk.debian.org/debian/ unstable/main libopenais3 amd64 1.1.2-2 [161 kB]
Get:108 http://ftp.uk.debian.org/debian/ unstable/main openais amd64 1.1.2-2 [301 kB]
Get:109 http://ftp.uk.debian.org/debian/ unstable/main openipmi amd64 2.0.16-1.2 [207 kB]
Get:110 http://ftp.uk.debian.org/debian/ unstable/main libopenipmi0 amd64 2.0.16-1.2 [636 kB]
Get:111 http://ftp.uk.debian.org/debian/ unstable/main openssh-client amd64 1:5.8p1-4 [1010 kB]
Get:112 http://ftp.uk.debian.org/debian/ unstable/main libgssapi-krb5-2 amd64 1.9.1+dfsg-1+b1 [147 kB]
Get:113 http://ftp.uk.debian.org/debian/ unstable/main libkeyutils1 amd64 1.4-5 [7216 B]
Get:114 http://ftp.uk.debian.org/debian/ unstable/main libk5crypto3 amd64 1.9.1+dfsg-1+b1 [111 kB]
Get:115 http://ftp.uk.debian.org/debian/ unstable/main libkrb5-3 amd64 1.9.1+dfsg-1+b1 [381 kB]
Get:116 http://ftp.uk.debian.org/debian/ unstable/main libkrb5support0 amd64 1.9.1+dfsg-1+b1 [46.9 kB]
Get:117 http://ftp.uk.debian.org/debian/ unstable/main libedit2 amd64 2.11-20080614-2 [71.0 kB]
Get:118 http://ftp.uk.debian.org/debian/ unstable/main libbsd0 amd64 0.3.0-1 [52.2 kB]
Get:119 http://ftp.uk.debian.org/debian/ unstable/main libssl1.0.0 amd64 1.0.0d-3 [1141 kB]
Get:120 http://ftp.uk.debian.org/debian/ unstable/main libperl5.12 amd64 5.12.4-1 [1152 B]
Get:121 http://ftp.uk.debian.org/debian/ unstable/main libgdbm3 amd64 1.8.3-10 [46.4 kB]
Get:122 http://ftp.uk.debian.org/debian/ unstable/main libdb4.8 amd64 4.8.30-9 [694 kB]
Get:123 http://ftp.uk.debian.org/debian/ unstable/main libexpat1 amd64 2.0.1-7 [137 kB]
Get:124 http://ftp.uk.debian.org/debian/ unstable/main mime-support all 3.51-1 [35.0 kB]
Get:125 http://ftp.uk.debian.org/debian/ unstable/main libccs3 amd64 3.0.12-2+b1 [30.9 kB]
Get:126 http://ftp.uk.debian.org/debian/ unstable/main libcman3 amd64 3.0.12-2+b1 [27.6 kB]
Get:127 http://ftp.uk.debian.org/debian/ unstable/main libdlm3 amd64 3.0.12-2+b1 [32.0 kB]
Get:128 http://ftp.uk.debian.org/debian/ unstable/main libdlmcontrol3 amd64 3.0.12-2+b1 [24.1 kB]
Get:129 http://ftp.uk.debian.org/debian/ unstable/main libfence4 amd64 3.0.12-2+b1 [27.0 kB]
Get:130 http://ftp.uk.debian.org/debian/ unstable/main liblogthread3 amd64 3.0.12-2+b1 [23.8 kB]
Get:131 http://ftp.uk.debian.org/debian/ unstable/main reiserfsprogs amd64 1:3.6.21-1 [523 kB]
Get:132 http://ftp.uk.debian.org/debian/ unstable/main scrub amd64 2.4-2 [29.0 kB]
Get:133 http://ftp.uk.debian.org/debian/ unstable/main sed amd64 4.2.1-9 [252 kB]
Get:134 http://ftp.uk.debian.org/debian/ unstable/main sensible-utils all 0.0.6 [6428 B]
Get:135 http://ftp.uk.debian.org/debian/ unstable/main sg3-utils amd64 1.31-1 [630 kB]
Get:136 http://ftp.uk.debian.org/debian/ unstable/main libsgutils2-2 amd64 1.31-1 [81.6 kB]
Get:137 http://ftp.uk.debian.org/debian/ unstable/main passwd amd64 1:4.1.4.2+svn3283-3 [1110 kB]
Get:138 http://ftp.uk.debian.org/debian/ unstable/main libpam-modules amd64 1.1.3-2 [340 kB]
Get:139 http://ftp.uk.debian.org/debian/ unstable/main libpam-modules-bin amd64 1.1.3-2 [108 kB]
Get:140 http://ftp.uk.debian.org/debian/ unstable/main libpam0g amd64 1.1.3-2 [122 kB]
Get:141 http://ftp.uk.debian.org/debian/ unstable/main libslang2 amd64 2.2.4-2 [579 kB]
Get:142 http://ftp.uk.debian.org/debian/ unstable/main libsqlite3-0 amd64 3.7.7-2 [420 kB]
Get:143 http://ftp.uk.debian.org/debian/ unstable/main strace amd64 4.5.20-2.3 [141 kB]
Get:144 http://ftp.uk.debian.org/debian/ unstable/main initscripts amd64 2.88dsf-13.10 [77.9 kB]
Get:145 http://ftp.uk.debian.org/debian/ unstable/main sysv-rc all 2.88dsf-13.10 [77.3 kB]
Get:146 http://ftp.uk.debian.org/debian/ unstable/main insserv amd64 1.14.0-2.1 [69.6 kB]
Get:147 http://ftp.uk.debian.org/debian/ unstable/main sysvinit-utils amd64 2.88dsf-13.10 [125 kB]
Get:148 http://ftp.uk.debian.org/debian/ unstable/main tar amd64 1.25-3 [969 kB]
Get:149 http://ftp.uk.debian.org/debian/ unstable/main libwrap0 amd64 7.6.q-21 [61.5 kB]
Get:150 http://ftp.uk.debian.org/debian/ unstable/main install-info amd64 4.13a.dfsg.1-6 [147 kB]
Get:151 http://ftp.uk.debian.org/debian/ unstable/main ucf all 3.0025+nmu2 [70.6 kB]
Err http://ftp.uk.debian.org/debian/ unstable/main libudev0 amd64 171-2
  404  Not Found [IP: 192.168.0.128 3128]
Err http://ftp.uk.debian.org/debian/ unstable/main udev amd64 171-2
  404  Not Found [IP: 192.168.0.128 3128]
Get:152 http://ftp.uk.debian.org/debian/ unstable/main ufsutils amd64 8.2-1 [160 kB]
Get:153 http://ftp.uk.debian.org/debian/ unstable/main bsdutils amd64 1:2.19.1-2 [81.0 kB]
Get:154 http://ftp.uk.debian.org/debian/ unstable/main libblkid1 amd64 2.19.1-2 [119 kB]
Get:155 http://ftp.uk.debian.org/debian/ unstable/main libuuid1 amd64 2.19.1-2 [59.6 kB]
Get:156 http://ftp.uk.debian.org/debian/ unstable/main mount amd64 2.19.1-2 [205 kB]
Get:157 http://ftp.uk.debian.org/debian/ unstable/main libsepol1 amd64 2.0.42-1 [132 kB]
Get:158 http://ftp.uk.debian.org/debian/ unstable/main libmount1 amd64 2.19.1-2 [110 kB]
Get:159 http://ftp.uk.debian.org/debian/ unstable/main util-linux amd64 2.19.1-2 [605 kB]
Get:160 http://ftp.uk.debian.org/debian/ unstable/main tzdata all 2011h-3 [742 kB]
Get:161 http://ftp.uk.debian.org/debian/ unstable/main vim-tiny amd64 2:7.3.154+hg~74503f6ee649-2+b1 [404 kB]
Get:162 http://ftp.uk.debian.org/debian/ unstable/main vim-common amd64 2:7.3.154+hg~74503f6ee649-2+b1 [162 kB]
Get:163 http://ftp.uk.debian.org/debian/ unstable/main libxenstore3.0 amd64 4.1.0-3 [26.4 kB]
Get:164 http://ftp.uk.debian.org/debian/ unstable/main xfsprogs amd64 3.1.5 [1456 kB]
Get:165 http://ftp.uk.debian.org/debian/ unstable/main xz-utils amd64 5.0.0-2 [201 kB]
Get:166 http://ftp.uk.debian.org/debian/ unstable/main liblzma2 amd64 5.0.0-2 [184 kB]
Get:167 http://ftp.uk.debian.org/debian/ unstable/main zerofree amd64 1.0.1-2 [7038 B]
Get:168 http://ftp.uk.debian.org/debian/ unstable/main zfs-fuse amd64 0.6.9-1+b1 [1407 kB]
Get:169 http://ftp.uk.debian.org/debian/ unstable/main libaio1 amd64 0.3.109-1 [8280 B]
Get:170 http://ftp.uk.debian.org/debian/ unstable/main zlib1g amd64 1:1.2.3.4.dfsg-3 [79.2 kB]
Fetched 64.1 MB in 2min 33s (416 kB/s)
febootstrap: aptitude: error: no file was downloaded corresponding to package libgcc1
make[2]: *** [stamp-supermin] Error 1
make[2]: Leaving directory `/home/rjones/d/libguestfs/appliance'
make[1]: *** [all-recursive] Error 1
make[1]: Leaving directory `/home/rjones/d/libguestfs'
make: *** [all] Error 2
+ failed 'build step'
+ mail -s 'builder-debian libguestfs FAILED build step 1f0c650c8ffdf0602ec74b999f62d3efa6822c96' libguestfs redhat com


[Date Prev][Date Next]   [Thread Prev][Thread Next]   [Thread Index] [Date Index] [Author Index]