[Date Prev][Date Next]   [Thread Prev][Thread Next]   [Thread Index] [Date Index] [Author Index]

[libvirt] Compilation error (storageRegister)



./configure --prefix=/usr --with-xen --without-sasl --without-avahi --without-test --without-libvirtd --sysconfdir=/etc --localstatedir=/var --without-qemu --without-storage-lvm --without-storage-iscsi

gcc -DUSE_READLINE -g -O2 -Wall -Wformat -Wformat-security -Wmissing-prototypes -Wnested-externs -Wpointer-arith -Wextra -Wshadow -Wcast-align -Wwrite-strings -Waggregate-return -Wstrict-prototypes -Winline -Wredundant-decls -Wno-sign-compare -Wp,-D_FORTIFY_SOURCE=2 -fexceptions -fasynchronous-unwind-tables -o .libs/virsh virsh-virsh.o virsh-console.o virsh-util-lib.o -Wall -Wformat -Wformat-security -Wmissing-prototypes -Wnested-externs -Wpointer-arith -Wextra -Wshadow -Wcast-align -Wwrite-strings -Waggregate-return -Wstrict-prototypes -Winline -Wredundant-decls -Wno-sign-compare -Wp,-D_FORTIFY_SOURCE=2 -fexceptions -fasynchronous-unwind-tables ./.libs/libvirt.so /usr/lib64/libxml2.so -ldl -lm /usr/lib64/libgnutls.so -L/usr/lib64 /usr/lib64/libtasn1.so -lz /usr/lib64/libgcrypt.so /usr/lib64/libgpg-error.so ../gnulib/lib/.libs/libgnu.a -lreadline -lxenstore
./.libs/libvirt.so: undefined reference to `storageRegister'
collect2: ld returned 1 exit status
make[2]: *** [virsh] Error 1
make[2]: *** Waiting for unfinished jobs....
mv -f .deps/libvirt_test_la-remote_internal.Tpo .deps/libvirt_test_la-remote_internal.Plo
make[2]: Leaving directory `/home/skinkie/external/libvirt/src'
make[1]: *** [all-recursive] Error 1
make[1]: Leaving directory `/home/skinkie/external/libvirt'
make: *** [all] Error 2


[Date Prev][Date Next]   [Thread Prev][Thread Next]   [Thread Index] [Date Index] [Author Index]