[Date Prev][Date Next]   [Thread Prev][Thread Next]   [Thread Index] [Date Index] [Author Index]

[libvirt] Test failures on current git master



I'm sincerely not sure what's going on here since the first validity
errors (for bond.xml) don't seem right to me, so I'll leave it to
whoever has an idea what the problem might be.

-- 
Diego Elio Pettenò — “Flameeyes”
http://blog.flameeyes.eu/

If you found a .asc file in this mail and know not what it is,
it's a GnuPG digital signature: http://www.gnupg.org/

Making check in gnulib/lib
Making check in include
Making check in libvirt
Making check in src
Making check in daemon
Making check in tools
Making check in proxy
Making check in docs
Making check in schemas
Making check in gnulib/tests
PASS: test-alignof
PASS: test-alloca-opt
PASS: test-areadlink
PASS: test-arpa_inet
PASS: test-base64
PASS: test-c-ctype
PASS: test-errno
PASS: test-fseeko.sh
PASS: test-fseeko2.sh
PASS: test-getaddrinfo
PASS: test-getdelim
PASS: test-gethostname
PASS: test-getline
PASS: test-gettimeofday
PASS: test-inet_ntop
PASS: test-inet_pton
PASS: test-lseek.sh
PASS: test-lstat
PASS: test-memchr
PASS: test-netdb
PASS: test-netinet_in
PASS: test-perror.sh
Unconnected socket test... passed
Connected sockets test... passed
General socket test with fork... passed
Pipe test... passed
PASS: test-poll
PASS: test-random_r
PASS: test-rawmemchr
PASS: test-readlink
Unconnected socket test... passed
Connected sockets test... passed
General socket test with fork... passed
Pipe test... passed
PASS: test-select
PASS: test-select-in.sh
PASS: test-select-out.sh
PASS: test-snprintf
PASS: test-sockets
PASS: test-stat
PASS: test-stdbool
PASS: test-stddef
PASS: test-stdint
PASS: test-stdio
PASS: test-stdlib
PASS: test-strchrnul
PASS: test-strerror
PASS: test-string
PASS: test-symlink
PASS: test-sys_select
PASS: test-sys_socket
PASS: test-sys_stat
PASS: test-sys_time
PASS: test-time
PASS: test-unistd
PASS: test-vasnprintf
PASS: test-vasprintf
PASS: test-vc-list-files-git.sh
PASS: test-vc-list-files-cvs.sh
PASS: test-wchar
===================
All 52 tests passed
===================
Making check in python
Making check in .
Making check in tests
Making check in tests
Making check in confdata
Making check in sexpr2xmldata
Making check in xml2sexprdata
Making check in xmconfigdata
Making check in xencapsdata
 1) virsh list (default)                                              ... OK
 2) virsh list (custom)                                               ... OK
 3) virsh nodeinfo (default)                                          ... OK
 4) virsh nodeinfo (custom)                                           ... OK
 5) virsh dominfo (by id)                                             ... OK
 6) virsh dominfo (by uuid)                                           ... OK
 7) virsh dominfo (by name)                                           ... OK
 8) virsh domid (by name)                                             ... OK
 9) virsh domid (by uuid)                                             ... OK
10) virsh domuuid (by id)                                             ... OK
11) virsh domuuid (by name)                                           ... OK
12) virsh domname (by id)                                             ... OK
13) virsh domname (by uuid)                                           ... OK
14) virsh domstate (by id)                                            ... OK
15) virsh domstate (by uuid)                                          ... OK
16) virsh domstate (by name)                                          ... OK
PASS: virshtest
 1) nodeinfo-1                                                        ... OK
 2) nodeinfo-2                                                        ... OK
 3) nodeinfo-3                                                        ... OK
 4) nodeinfo-4                                                        ... OK
 5) nodeinfo-5                                                        ... OK
 6) nodeinfo-6                                                        ... OK
PASS: nodeinfotest
PASS: statstest
 1) Parse foo=one&bar=two                                             ... OK
 2) Format foo=one&bar=two                                            ... OK
 3) Build foo=one&bar=two                                             ... OK
 4) Parse foo=one&foo=two                                             ... OK
 5) Format foo=one&foo=two                                            ... OK
 6) Build foo=one&foo=two                                             ... OK
 7) Parse foo=one&&foo=two                                            ... OK
 8) Format foo=one&&foo=two                                           ... OK
 9) Build foo=one&&foo=two                                            ... OK
10) Parse foo=one;foo=two                                             ... OK
11) Format foo=one;foo=two                                            ... OK
12) Build foo=one;foo=two                                             ... OK
13) Parse foo                                                         ... OK
14) Format foo                                                        ... OK
15) Build foo                                                         ... OK
16) Parse foo=                                                        ... OK
17) Format foo=                                                       ... OK
18) Build foo=                                                        ... OK
19) Parse foo=&                                                       ... OK
20) Format foo=&                                                      ... OK
21) Build foo=&                                                       ... OK
22) Parse foo=&&                                                      ... OK
23) Format foo=&&                                                     ... OK
24) Build foo=&&                                                      ... OK
25) Parse foo=one%20two                                               ... OK
26) Format foo=one%20two                                              ... OK
27) Build foo=one%20two                                               ... OK
28) Parse =bogus&foo=one                                              ... OK
29) Format =bogus&foo=one                                             ... OK
30) Build =bogus&foo=one                                              ... OK
31) New vargs                                                         ... OK
32) Add vargs                                                         ... OK
PASS: qparamtest
   1) capabilityschemadata/caps-test.xml  OK
   2) capabilityschemadata/caps-qemu-kvm.xml  OK
   3) xencapsdata/xen-ia64-hvm.xml  OK
   4) xencapsdata/xen-i686-pae.xml  OK
   5) xencapsdata/xen-x86_64-hvm.xml  OK
   6) xencapsdata/xen-ia64-be-hvm.xml  OK
   7) xencapsdata/xen-i686-pae-hvm.xml  OK
   8) xencapsdata/xen-x86_64.xml  OK
   9) xencapsdata/xen-ia64.xml  OK
  10) xencapsdata/xen-ppc64.xml  OK
  11) xencapsdata/xen-i686.xml  OK
  12) xencapsdata/xen-ia64-be.xml  OK
Validated 12 files, 0 failed
PASS: capabilityschematest
   1) interfaceschemadata/bridge-vlan.xml  OK
   2) interfaceschemadata/bridge-no-address.xml  OK
   3) interfaceschemadata/bond.xml  FAILED
xmllint --relaxng ./../docs/schemas/interface.rng --noout /home/flame/devel/repos/git/libvirt/tests/interfaceschemadata/bond.xml
/home/flame/devel/repos/git/libvirt/tests/interfaceschemadata/bond.xml:1: element interface: Relax-NG validity error : Element interface failed to validate attributes
Relax-NG validity error : Element ip failed to validate attributes
/home/flame/devel/repos/git/libvirt/tests/interfaceschemadata/bond.xml:4: element ip: Relax-NG validity error : Invalid attribute address for element ip
/home/flame/devel/repos/git/libvirt/tests/interfaceschemadata/bond.xml:5: element route: Relax-NG validity error : Element protocol failed to validate content
/home/flame/devel/repos/git/libvirt/tests/interfaceschemadata/bond.xml:7: element bond: Relax-NG validity error : Did not expect element bond there
/home/flame/devel/repos/git/libvirt/tests/interfaceschemadata/bond.xml fails to validate
   4) interfaceschemadata/bond-arp.xml  FAILED
xmllint --relaxng ./../docs/schemas/interface.rng --noout /home/flame/devel/repos/git/libvirt/tests/interfaceschemadata/bond-arp.xml
/home/flame/devel/repos/git/libvirt/tests/interfaceschemadata/bond-arp.xml:1: element interface: Relax-NG validity error : Element interface failed to validate attributes
Relax-NG validity error : Element ip failed to validate attributes
/home/flame/devel/repos/git/libvirt/tests/interfaceschemadata/bond-arp.xml:4: element ip: Relax-NG validity error : Invalid attribute address for element ip
/home/flame/devel/repos/git/libvirt/tests/interfaceschemadata/bond-arp.xml:5: element route: Relax-NG validity error : Element protocol failed to validate content
/home/flame/devel/repos/git/libvirt/tests/interfaceschemadata/bond-arp.xml:7: element bond: Relax-NG validity error : Did not expect element bond there
/home/flame/devel/repos/git/libvirt/tests/interfaceschemadata/bond-arp.xml fails to validate
   5) interfaceschemadata/vlan.xml  OK
   6) interfaceschemadata/ethernet-static.xml  FAILED
xmllint --relaxng ./../docs/schemas/interface.rng --noout /home/flame/devel/repos/git/libvirt/tests/interfaceschemadata/ethernet-static.xml
/home/flame/devel/repos/git/libvirt/tests/interfaceschemadata/ethernet-static.xml:3: element protocol: Relax-NG validity error : Element interface has extra content: protocol
/home/flame/devel/repos/git/libvirt/tests/interfaceschemadata/ethernet-static.xml:1: element interface: Relax-NG validity error : Element interface failed to validate attributes
Relax-NG validity error : Element ip failed to validate attributes
/home/flame/devel/repos/git/libvirt/tests/interfaceschemadata/ethernet-static.xml:4: element ip: Relax-NG validity error : Invalid attribute address for element ip
/home/flame/devel/repos/git/libvirt/tests/interfaceschemadata/ethernet-static.xml:5: element route: Relax-NG validity error : Element protocol failed to validate content
/home/flame/devel/repos/git/libvirt/tests/interfaceschemadata/ethernet-static.xml fails to validate
   7) interfaceschemadata/ethernet-static-no-prefix.xml  FAILED
xmllint --relaxng ./../docs/schemas/interface.rng --noout /home/flame/devel/repos/git/libvirt/tests/interfaceschemadata/ethernet-static-no-prefix.xml
/home/flame/devel/repos/git/libvirt/tests/interfaceschemadata/ethernet-static-no-prefix.xml:3: element protocol: Relax-NG validity error : Element interface has extra content: protocol
/home/flame/devel/repos/git/libvirt/tests/interfaceschemadata/ethernet-static-no-prefix.xml:1: element interface: Relax-NG validity error : Element interface failed to validate attributes
/home/flame/devel/repos/git/libvirt/tests/interfaceschemadata/ethernet-static-no-prefix.xml:4: element ip: Relax-NG validity error : Element ip failed to validate attributes
/home/flame/devel/repos/git/libvirt/tests/interfaceschemadata/ethernet-static-no-prefix.xml:5: element route: Relax-NG validity error : Element protocol failed to validate content
/home/flame/devel/repos/git/libvirt/tests/interfaceschemadata/ethernet-static-no-prefix.xml:1: element interface: Relax-NG validity error : Expecting an element , got nothing
/home/flame/devel/repos/git/libvirt/tests/interfaceschemadata/ethernet-static-no-prefix.xml fails to validate
   8) interfaceschemadata/bridge.xml  OK
   9) interfaceschemadata/ethernet-dhcp.xml  OK
  10) interfaceschemadata/bridge42.xml  OK
Validated 10 files, 4 failed
FAIL: interfaceschematest
   1) network/default.xml  OK
   2) networkxml2xmlin/isolated-network.xml  OK
   3) networkxml2xmlin/nat-network.xml  OK
   4) networkxml2xmlin/routed-network.xml  OK
   5) networkxml2xmlin/netboot-network.xml  OK
   6) networkxml2xmlin/netboot-proxy-network.xml  OK
   7) networkxml2xmlout/isolated-network.xml  OK
   8) networkxml2xmlout/nat-network.xml  OK
   9) networkxml2xmlout/routed-network.xml  OK
  10) networkxml2xmlout/netboot-network.xml  OK
  11) networkxml2xmlout/netboot-proxy-network.xml  OK
Validated 11 files, 0 failed
PASS: networkschematest
   1) storagepoolxml2xmlin/pool-fs.xml  OK
   2) storagepoolxml2xmlin/pool-netfs.xml  OK
   3) storagepoolxml2xmlin/pool-mpath.xml  OK
   4) storagepoolxml2xmlin/pool-dir.xml  OK
   5) storagepoolxml2xmlin/pool-disk.xml  OK
   6) storagepoolxml2xmlin/pool-iscsi.xml  OK
   7) storagepoolxml2xmlin/pool-logical-create.xml  OK
   8) storagepoolxml2xmlin/pool-scsi.xml  OK
   9) storagepoolxml2xmlin/pool-iscsi-auth.xml  OK
  10) storagepoolxml2xmlin/pool-logical.xml  OK
  11) storagepoolxml2xmlout/pool-fs.xml  OK
  12) storagepoolxml2xmlout/pool-netfs.xml  OK
  13) storagepoolxml2xmlout/pool-mpath.xml  OK
  14) storagepoolxml2xmlout/pool-dir.xml  OK
  15) storagepoolxml2xmlout/pool-disk.xml  OK
  16) storagepoolxml2xmlout/pool-iscsi.xml  OK
  17) storagepoolxml2xmlout/pool-logical-create.xml  OK
  18) storagepoolxml2xmlout/pool-scsi.xml  OK
  19) storagepoolxml2xmlout/pool-iscsi-auth.xml  OK
  20) storagepoolxml2xmlout/pool-logical.xml  OK
Validated 20 files, 0 failed
PASS: storagepoolschematest
   1) storagevolxml2xmlin/vol-file-backing.xml  OK
   2) storagevolxml2xmlin/vol-logical.xml  OK
   3) storagevolxml2xmlin/vol-logical-backing.xml  OK
   4) storagevolxml2xmlin/vol-qcow2.xml  OK
   5) storagevolxml2xmlin/vol-file.xml  OK
   6) storagevolxml2xmlin/vol-partition.xml  OK
   7) storagevolxml2xmlout/vol-file-backing.xml  OK
   8) storagevolxml2xmlout/vol-logical.xml  OK
   9) storagevolxml2xmlout/vol-logical-backing.xml  OK
  10) storagevolxml2xmlout/vol-qcow2.xml  OK
  11) storagevolxml2xmlout/vol-file.xml  OK
  12) storagevolxml2xmlout/vol-partition.xml  OK
Validated 12 files, 0 failed
PASS: storagevolschematest
   1) domainschemadata/domain-lxc-simple.xml  OK
   2) qemuxml2argvdata/qemuxml2argv-serial-tcp-chardev.xml  OK
   3) qemuxml2argvdata/qemuxml2argv-serial-file.xml  OK
   4) qemuxml2argvdata/qemuxml2argv-serial-unix-chardev.xml  OK
   5) qemuxml2argvdata/qemuxml2argv-hostdev-pci-address.xml  OK
   6) qemuxml2argvdata/qemuxml2argv-boot-floppy.xml  OK
   7) qemuxml2argvdata/qemuxml2argv-hostdev-usb-address.xml  OK
   8) qemuxml2argvdata/qemuxml2argv-machine-aliases2.xml  OK
   9) qemuxml2argvdata/qemuxml2argv-serial-udp-chardev.xml  OK
  10) qemuxml2argvdata/qemuxml2argv-serial-tcp-telnet-chardev.xml  OK
  11) qemuxml2argvdata/qemuxml2argv-graphics-sdl-fullscreen.xml  OK
  12) qemuxml2argvdata/qemuxml2argv-disk-drive-cache-v1-wt.xml  OK
  13) qemuxml2argvdata/qemuxml2argv-minimal.xml  OK
  14) qemuxml2argvdata/qemuxml2argv-disk-floppy.xml  OK
  15) qemuxml2argvdata/qemuxml2argv-restore-v1.xml  OK
  16) qemuxml2argvdata/qemuxml2argv-disk-usb.xml  OK
  17) qemuxml2argvdata/qemuxml2argv-misc-uuid.xml  OK
  18) qemuxml2argvdata/qemuxml2argv-net-eth-names.xml  OK
  19) qemuxml2argvdata/qemuxml2argv-disk-drive-cache-v2-none.xml  OK
  20) qemuxml2argvdata/qemuxml2argv-graphics-vnc.xml  FAILED
xmllint --relaxng ./../docs/schemas/domain.rng --noout /home/flame/devel/repos/git/libvirt/tests/qemuxml2argvdata/qemuxml2argv-graphics-vnc.xml
Relax-NG validity error : Extra element devices in interleave
/home/flame/devel/repos/git/libvirt/tests/qemuxml2argvdata/qemuxml2argv-graphics-vnc.xml:15: element devices: Relax-NG validity error : Element domain failed to validate content
/home/flame/devel/repos/git/libvirt/tests/qemuxml2argvdata/qemuxml2argv-graphics-vnc.xml fails to validate
  21) qemuxml2argvdata/qemuxml2argv-floppy-drive-fat.xml  OK
  22) qemuxml2argvdata/qemuxml2argv-migrate.xml  OK
  23) qemuxml2argvdata/qemuxml2argv-graphics-sdl.xml  OK
  24) qemuxml2argvdata/qemuxml2argv-disk-drive-fmt-qcow.xml  OK
  25) qemuxml2argvdata/qemuxml2argv-misc-acpi.xml  OK
  26) qemuxml2argvdata/qemuxml2argv-graphics-vnc-sasl.xml  FAILED
xmllint --relaxng ./../docs/schemas/domain.rng --noout /home/flame/devel/repos/git/libvirt/tests/qemuxml2argvdata/qemuxml2argv-graphics-vnc-sasl.xml
Relax-NG validity error : Extra element devices in interleave
/home/flame/devel/repos/git/libvirt/tests/qemuxml2argvdata/qemuxml2argv-graphics-vnc-sasl.xml:15: element devices: Relax-NG validity error : Element domain failed to validate content
/home/flame/devel/repos/git/libvirt/tests/qemuxml2argvdata/qemuxml2argv-graphics-vnc-sasl.xml fails to validate
  27) qemuxml2argvdata/qemuxml2argv-disk-drive-boot-cdrom.xml  OK
  28) qemuxml2argvdata/qemuxml2argv-clock-localtime.xml  OK
  29) qemuxml2argvdata/qemuxml2argv-boot-network.xml  OK
  30) qemuxml2argvdata/qemuxml2argv-serial-many.xml  OK
  31) qemuxml2argvdata/qemuxml2argv-hugepages.xml  OK
  32) qemuxml2argvdata/qemuxml2argv-serial-pty-chardev.xml  OK
  33) qemuxml2argvdata/qemuxml2argv-serial-dev-chardev.xml  OK
  34) qemuxml2argvdata/qemuxml2argv-disk-virtio.xml  OK
  35) qemuxml2argvdata/qemuxml2argv-disk-cdrom.xml  OK
  36) qemuxml2argvdata/qemuxml2argv-graphics-vnc-tls.xml  FAILED
xmllint --relaxng ./../docs/schemas/domain.rng --noout /home/flame/devel/repos/git/libvirt/tests/qemuxml2argvdata/qemuxml2argv-graphics-vnc-tls.xml
Relax-NG validity error : Extra element devices in interleave
/home/flame/devel/repos/git/libvirt/tests/qemuxml2argvdata/qemuxml2argv-graphics-vnc-tls.xml:15: element devices: Relax-NG validity error : Element domain failed to validate content
/home/flame/devel/repos/git/libvirt/tests/qemuxml2argvdata/qemuxml2argv-graphics-vnc-tls.xml fails to validate
  37) qemuxml2argvdata/qemuxml2argv-machine-aliases1.xml  OK
  38) qemuxml2argvdata/qemuxml2argv-console-compat.xml  OK
  39) qemuxml2argvdata/qemuxml2argv-bootloader.xml  OK
  40) qemuxml2argvdata/qemuxml2argv-disk-drive-cache-v1-none.xml  OK
  41) qemuxml2argvdata/qemuxml2argv-restore-v2.xml  OK
  42) qemuxml2argvdata/qemuxml2argv-net-user.xml  OK
  43) qemuxml2argvdata/qemuxml2argv-serial-dev.xml  OK
  44) qemuxml2argvdata/qemuxml2argv-serial-vc.xml  OK
  45) qemuxml2argvdata/qemuxml2argv-input-usbtablet.xml  OK
  46) qemuxml2argvdata/qemuxml2argv-console-compat-chardev.xml  OK
  47) qemuxml2argvdata/qemuxml2argv-serial-udp.xml  OK
  48) qemuxml2argvdata/qemuxml2argv-disk-drive-fat.xml  OK
  49) qemuxml2argvdata/qemuxml2argv-hostdev-usb-product.xml  OK
  50) qemuxml2argvdata/qemuxml2argv-serial-tcp-telnet.xml  OK
  51) qemuxml2argvdata/qemuxml2argv-serial-vc-chardev.xml  OK
  52) qemuxml2argvdata/qemuxml2argv-disk-many.xml  OK
  53) qemuxml2argvdata/qemuxml2argv-channel-guestfwd.xml  OK
  54) qemuxml2argvdata/qemuxml2argv-boot-cdrom.xml  OK
  55) qemuxml2argvdata/qemuxml2argv-serial-tcp.xml  OK
  56) qemuxml2argvdata/qemuxml2argv-misc-no-reboot.xml  OK
  57) qemuxml2argvdata/qemuxml2argv-input-usbmouse.xml  OK
  58) qemuxml2argvdata/qemuxml2argv-serial-file-chardev.xml  OK
  59) qemuxml2argvdata/qemuxml2argv-clock-utc.xml  OK
  60) qemuxml2argvdata/qemuxml2argv-serial-unix.xml  OK
  61) qemuxml2argvdata/qemuxml2argv-parallel-tcp.xml  OK
  62) qemuxml2argvdata/qemuxml2argv-sound.xml  OK
  63) qemuxml2argvdata/qemuxml2argv-disk-drive-boot-disk.xml  OK
  64) qemuxml2argvdata/qemuxml2argv-disk-drive-shared.xml  OK
  65) qemuxml2argvdata/qemuxml2argv-net-eth.xml  OK
  66) qemuxml2argvdata/qemuxml2argv-watchdog.xml  OK
  67) qemuxml2argvdata/qemuxml2argv-disk-drive-cache-v2-wb.xml  OK
  68) qemuxml2argvdata/qemuxml2argv-net-virtio.xml  OK
  69) qemuxml2argvdata/qemuxml2argv-serial-many-chardev.xml  OK
  70) qemuxml2argvdata/qemuxml2argv-disk-cdrom-empty.xml  OK
  71) qemuxml2argvdata/qemuxml2argv-disk-drive-cache-v2-wt.xml  OK
  72) qemuxml2argvdata/qemuxml2argv-serial-pty.xml  OK
  73) qemuxml2argvdata/qemuxml2argv-disk-xenvbd.xml  OK
  74) qemuxml2argvdata/qemuxml2argv-parallel-tcp-chardev.xml  OK
  75) qemuxml2argvdata/qemuxml2argv-input-xen.xml  FAILED
xmllint --relaxng ./../docs/schemas/domain.rng --noout /home/flame/devel/repos/git/libvirt/tests/qemuxml2argvdata/qemuxml2argv-input-xen.xml
Relax-NG validity error : Extra element devices in interleave
/home/flame/devel/repos/git/libvirt/tests/qemuxml2argvdata/qemuxml2argv-input-xen.xml:15: element devices: Relax-NG validity error : Element domain failed to validate content
/home/flame/devel/repos/git/libvirt/tests/qemuxml2argvdata/qemuxml2argv-input-xen.xml fails to validate
  76) qemuxml2argvdata/qemuxml2argv-disk-drive-cache-v1-wb.xml  OK
  77) qemuxml2argvdata/qemuxml2argv-net-eth-ifname.xml  OK
  78) sexpr2xmldata/sexpr2xml-net-routed.xml  FAILED
xmllint --relaxng ./../docs/schemas/domain.rng --noout /home/flame/devel/repos/git/libvirt/tests/sexpr2xmldata/sexpr2xml-net-routed.xml
Relax-NG validity error : Extra element devices in interleave
/home/flame/devel/repos/git/libvirt/tests/sexpr2xmldata/sexpr2xml-net-routed.xml:1: element domain: Relax-NG validity error : Element domain failed to validate content
/home/flame/devel/repos/git/libvirt/tests/sexpr2xmldata/sexpr2xml-net-routed.xml fails to validate
  79) sexpr2xmldata/sexpr2xml-fv-serial-tcp.xml  OK
  80) sexpr2xmldata/sexpr2xml-fv-serial-pty.xml  OK
  81) sexpr2xmldata/sexpr2xml-net-e1000.xml  OK
  82) sexpr2xmldata/sexpr2xml-fv-net-netfront.xml  OK
  83) sexpr2xmldata/sexpr2xml-fv-net-ioemu.xml  OK
  84) sexpr2xmldata/sexpr2xml-fv-utc.xml  OK
  85) sexpr2xmldata/sexpr2xml-curmem.xml  OK
  86) sexpr2xmldata/sexpr2xml-fv-serial-file.xml  OK
  87) sexpr2xmldata/sexpr2xml-fv-serial-unix.xml  OK
  88) sexpr2xmldata/sexpr2xml-fv-parallel-tcp.xml  OK
  89) sexpr2xmldata/sexpr2xml-fv-sound-all.xml  OK
  90) sexpr2xmldata/sexpr2xml-fv-serial-tcp-telnet.xml  OK
  91) sexpr2xmldata/sexpr2xml-pv.xml  OK
  92) sexpr2xmldata/sexpr2xml-fv-usbmouse.xml  OK
  93) sexpr2xmldata/sexpr2xml-pv-localtime.xml  OK
  94) sexpr2xmldata/sexpr2xml-fv-kernel.xml  OK
  95) sexpr2xmldata/sexpr2xml-disk-drv-blktap-qcow.xml  OK
  96) sexpr2xmldata/sexpr2xml-no-source-cdrom.xml  OK
  97) sexpr2xmldata/sexpr2xml-fv-serial-stdio.xml  OK
  98) sexpr2xmldata/sexpr2xml-fv-serial-pipe.xml  OK
  99) sexpr2xmldata/sexpr2xml-pv-bootloader.xml  OK
 100) sexpr2xmldata/sexpr2xml-fv-sound.xml  OK
 101) sexpr2xmldata/sexpr2xml-fv-usbtablet.xml  OK
 102) sexpr2xmldata/sexpr2xml-bridge-ipaddr.xml  FAILED
xmllint --relaxng ./../docs/schemas/domain.rng --noout /home/flame/devel/repos/git/libvirt/tests/sexpr2xmldata/sexpr2xml-bridge-ipaddr.xml
Relax-NG validity error : Extra element devices in interleave
/home/flame/devel/repos/git/libvirt/tests/sexpr2xmldata/sexpr2xml-bridge-ipaddr.xml:1: element domain: Relax-NG validity error : Element domain failed to validate content
/home/flame/devel/repos/git/libvirt/tests/sexpr2xmldata/sexpr2xml-bridge-ipaddr.xml fails to validate
 103) sexpr2xmldata/sexpr2xml-fv-autoport.xml  OK
 104) sexpr2xmldata/sexpr2xml-fv.xml  OK
 105) sexpr2xmldata/sexpr2xml-fv-localtime.xml  OK
 106) sexpr2xmldata/sexpr2xml-fv-serial-udp.xml  OK
 107) sexpr2xmldata/sexpr2xml-fv-legacy-vfb.xml  OK
 108) sexpr2xmldata/sexpr2xml-pv-vfb-new-vncdisplay.xml  FAILED
xmllint --relaxng ./../docs/schemas/domain.rng --noout /home/flame/devel/repos/git/libvirt/tests/sexpr2xmldata/sexpr2xml-pv-vfb-new-vncdisplay.xml
Relax-NG validity error : Extra element devices in interleave
/home/flame/devel/repos/git/libvirt/tests/sexpr2xmldata/sexpr2xml-pv-vfb-new-vncdisplay.xml:1: element domain: Relax-NG validity error : Element domain failed to validate content
/home/flame/devel/repos/git/libvirt/tests/sexpr2xmldata/sexpr2xml-pv-vfb-new-vncdisplay.xml fails to validate
 109) sexpr2xmldata/sexpr2xml-pv-vfb-type-crash.xml  OK
 110) sexpr2xmldata/sexpr2xml-disk-block.xml  OK
 111) sexpr2xmldata/sexpr2xml-disk-file.xml  OK
 112) sexpr2xmldata/sexpr2xml-fv-serial-null.xml  OK
 113) sexpr2xmldata/sexpr2xml-pv-vfb-orig.xml  FAILED
xmllint --relaxng ./../docs/schemas/domain.rng --noout /home/flame/devel/repos/git/libvirt/tests/sexpr2xmldata/sexpr2xml-pv-vfb-orig.xml
Relax-NG validity error : Extra element devices in interleave
/home/flame/devel/repos/git/libvirt/tests/sexpr2xmldata/sexpr2xml-pv-vfb-orig.xml:1: element domain: Relax-NG validity error : Element domain failed to validate content
/home/flame/devel/repos/git/libvirt/tests/sexpr2xmldata/sexpr2xml-pv-vfb-orig.xml fails to validate
 114) sexpr2xmldata/sexpr2xml-disk-block-shareable.xml  OK
 115) sexpr2xmldata/sexpr2xml-pv-vfb-new.xml  FAILED
xmllint --relaxng ./../docs/schemas/domain.rng --noout /home/flame/devel/repos/git/libvirt/tests/sexpr2xmldata/sexpr2xml-pv-vfb-new.xml
Relax-NG validity error : Extra element devices in interleave
/home/flame/devel/repos/git/libvirt/tests/sexpr2xmldata/sexpr2xml-pv-vfb-new.xml:1: element domain: Relax-NG validity error : Element domain failed to validate content
/home/flame/devel/repos/git/libvirt/tests/sexpr2xmldata/sexpr2xml-pv-vfb-new.xml fails to validate
 116) sexpr2xmldata/sexpr2xml-fv-v2.xml  OK
 117) sexpr2xmldata/sexpr2xml-net-bridged.xml  OK
 118) sexpr2xmldata/sexpr2xml-disk-drv-blktap-raw.xml  OK
 119) sexpr2xmldata/sexpr2xml-pci-devs.xml  OK
 120) xmconfigdata/test-fullvirt-serial-tcp.xml  FAILED
xmllint --relaxng ./../docs/schemas/domain.rng --noout /home/flame/devel/repos/git/libvirt/tests/xmconfigdata/test-fullvirt-serial-tcp.xml
Relax-NG validity error : Extra element devices in interleave
/home/flame/devel/repos/git/libvirt/tests/xmconfigdata/test-fullvirt-serial-tcp.xml:21: element devices: Relax-NG validity error : Element domain failed to validate content
/home/flame/devel/repos/git/libvirt/tests/xmconfigdata/test-fullvirt-serial-tcp.xml fails to validate
 121) xmconfigdata/test-fullvirt-utc.xml  FAILED
xmllint --relaxng ./../docs/schemas/domain.rng --noout /home/flame/devel/repos/git/libvirt/tests/xmconfigdata/test-fullvirt-utc.xml
Relax-NG validity error : Extra element devices in interleave
/home/flame/devel/repos/git/libvirt/tests/xmconfigdata/test-fullvirt-utc.xml:21: element devices: Relax-NG validity error : Element domain failed to validate content
/home/flame/devel/repos/git/libvirt/tests/xmconfigdata/test-fullvirt-utc.xml fails to validate
 122) xmconfigdata/test-fullvirt-usbtablet.xml  FAILED
xmllint --relaxng ./../docs/schemas/domain.rng --noout /home/flame/devel/repos/git/libvirt/tests/xmconfigdata/test-fullvirt-usbtablet.xml
Relax-NG validity error : Extra element devices in interleave
/home/flame/devel/repos/git/libvirt/tests/xmconfigdata/test-fullvirt-usbtablet.xml:21: element devices: Relax-NG validity error : Element domain failed to validate content
/home/flame/devel/repos/git/libvirt/tests/xmconfigdata/test-fullvirt-usbtablet.xml fails to validate
 123) xmconfigdata/test-paravirt-new-pvfb-vncdisplay.xml  FAILED
xmllint --relaxng ./../docs/schemas/domain.rng --noout /home/flame/devel/repos/git/libvirt/tests/xmconfigdata/test-paravirt-new-pvfb-vncdisplay.xml
Relax-NG validity error : Extra element devices in interleave
/home/flame/devel/repos/git/libvirt/tests/xmconfigdata/test-paravirt-new-pvfb-vncdisplay.xml:15: element devices: Relax-NG validity error : Element domain failed to validate content
/home/flame/devel/repos/git/libvirt/tests/xmconfigdata/test-paravirt-new-pvfb-vncdisplay.xml fails to validate
 124) xmconfigdata/test-fullvirt-serial-tcp-telnet.xml  FAILED
xmllint --relaxng ./../docs/schemas/domain.rng --noout /home/flame/devel/repos/git/libvirt/tests/xmconfigdata/test-fullvirt-serial-tcp-telnet.xml
Relax-NG validity error : Extra element devices in interleave
/home/flame/devel/repos/git/libvirt/tests/xmconfigdata/test-fullvirt-serial-tcp-telnet.xml:21: element devices: Relax-NG validity error : Element domain failed to validate content
/home/flame/devel/repos/git/libvirt/tests/xmconfigdata/test-fullvirt-serial-tcp-telnet.xml fails to validate
 125) xmconfigdata/test-escape-paths.xml  FAILED
xmllint --relaxng ./../docs/schemas/domain.rng --noout /home/flame/devel/repos/git/libvirt/tests/xmconfigdata/test-escape-paths.xml
Relax-NG validity error : Extra element devices in interleave
/home/flame/devel/repos/git/libvirt/tests/xmconfigdata/test-escape-paths.xml:21: element devices: Relax-NG validity error : Element domain failed to validate content
/home/flame/devel/repos/git/libvirt/tests/xmconfigdata/test-escape-paths.xml fails to validate
 126) xmconfigdata/test-paravirt-new-pvfb.xml  FAILED
xmllint --relaxng ./../docs/schemas/domain.rng --noout /home/flame/devel/repos/git/libvirt/tests/xmconfigdata/test-paravirt-new-pvfb.xml
Relax-NG validity error : Extra element devices in interleave
/home/flame/devel/repos/git/libvirt/tests/xmconfigdata/test-paravirt-new-pvfb.xml:15: element devices: Relax-NG validity error : Element domain failed to validate content
/home/flame/devel/repos/git/libvirt/tests/xmconfigdata/test-paravirt-new-pvfb.xml fails to validate
 127) xmconfigdata/test-paravirt-old-pvfb.xml  FAILED
xmllint --relaxng ./../docs/schemas/domain.rng --noout /home/flame/devel/repos/git/libvirt/tests/xmconfigdata/test-paravirt-old-pvfb.xml
Relax-NG validity error : Extra element devices in interleave
/home/flame/devel/repos/git/libvirt/tests/xmconfigdata/test-paravirt-old-pvfb.xml:15: element devices: Relax-NG validity error : Element domain failed to validate content
/home/flame/devel/repos/git/libvirt/tests/xmconfigdata/test-paravirt-old-pvfb.xml fails to validate
 128) xmconfigdata/test-fullvirt-parallel-tcp.xml  FAILED
xmllint --relaxng ./../docs/schemas/domain.rng --noout /home/flame/devel/repos/git/libvirt/tests/xmconfigdata/test-fullvirt-parallel-tcp.xml
Relax-NG validity error : Extra element devices in interleave
/home/flame/devel/repos/git/libvirt/tests/xmconfigdata/test-fullvirt-parallel-tcp.xml:21: element devices: Relax-NG validity error : Element domain failed to validate content
/home/flame/devel/repos/git/libvirt/tests/xmconfigdata/test-fullvirt-parallel-tcp.xml fails to validate
 129) xmconfigdata/test-paravirt-net-e1000.xml  FAILED
xmllint --relaxng ./../docs/schemas/domain.rng --noout /home/flame/devel/repos/git/libvirt/tests/xmconfigdata/test-paravirt-net-e1000.xml
Relax-NG validity error : Extra element devices in interleave
/home/flame/devel/repos/git/libvirt/tests/xmconfigdata/test-paravirt-net-e1000.xml:15: element devices: Relax-NG validity error : Element domain failed to validate content
/home/flame/devel/repos/git/libvirt/tests/xmconfigdata/test-paravirt-net-e1000.xml fails to validate
 130) xmconfigdata/test-fullvirt-usbmouse.xml  FAILED
xmllint --relaxng ./../docs/schemas/domain.rng --noout /home/flame/devel/repos/git/libvirt/tests/xmconfigdata/test-fullvirt-usbmouse.xml
Relax-NG validity error : Extra element devices in interleave
/home/flame/devel/repos/git/libvirt/tests/xmconfigdata/test-fullvirt-usbmouse.xml:21: element devices: Relax-NG validity error : Element domain failed to validate content
/home/flame/devel/repos/git/libvirt/tests/xmconfigdata/test-fullvirt-usbmouse.xml fails to validate
 131) xmconfigdata/test-fullvirt-serial-file.xml  FAILED
xmllint --relaxng ./../docs/schemas/domain.rng --noout /home/flame/devel/repos/git/libvirt/tests/xmconfigdata/test-fullvirt-serial-file.xml
Relax-NG validity error : Extra element devices in interleave
/home/flame/devel/repos/git/libvirt/tests/xmconfigdata/test-fullvirt-serial-file.xml:21: element devices: Relax-NG validity error : Element domain failed to validate content
/home/flame/devel/repos/git/libvirt/tests/xmconfigdata/test-fullvirt-serial-file.xml fails to validate
 132) xmconfigdata/test-fullvirt-serial-unix.xml  FAILED
xmllint --relaxng ./../docs/schemas/domain.rng --noout /home/flame/devel/repos/git/libvirt/tests/xmconfigdata/test-fullvirt-serial-unix.xml
Relax-NG validity error : Extra element devices in interleave
/home/flame/devel/repos/git/libvirt/tests/xmconfigdata/test-fullvirt-serial-unix.xml:21: element devices: Relax-NG validity error : Element domain failed to validate content
/home/flame/devel/repos/git/libvirt/tests/xmconfigdata/test-fullvirt-serial-unix.xml fails to validate
 133) xmconfigdata/test-fullvirt-serial-null.xml  FAILED
xmllint --relaxng ./../docs/schemas/domain.rng --noout /home/flame/devel/repos/git/libvirt/tests/xmconfigdata/test-fullvirt-serial-null.xml
Relax-NG validity error : Extra element devices in interleave
/home/flame/devel/repos/git/libvirt/tests/xmconfigdata/test-fullvirt-serial-null.xml:21: element devices: Relax-NG validity error : Element domain failed to validate content
/home/flame/devel/repos/git/libvirt/tests/xmconfigdata/test-fullvirt-serial-null.xml fails to validate
 134) xmconfigdata/test-fullvirt-serial-stdio.xml  FAILED
xmllint --relaxng ./../docs/schemas/domain.rng --noout /home/flame/devel/repos/git/libvirt/tests/xmconfigdata/test-fullvirt-serial-stdio.xml
Relax-NG validity error : Extra element devices in interleave
/home/flame/devel/repos/git/libvirt/tests/xmconfigdata/test-fullvirt-serial-stdio.xml:21: element devices: Relax-NG validity error : Element domain failed to validate content
/home/flame/devel/repos/git/libvirt/tests/xmconfigdata/test-fullvirt-serial-stdio.xml fails to validate
 135) xmconfigdata/test-fullvirt-old-cdrom.xml  FAILED
xmllint --relaxng ./../docs/schemas/domain.rng --noout /home/flame/devel/repos/git/libvirt/tests/xmconfigdata/test-fullvirt-old-cdrom.xml
Relax-NG validity error : Extra element devices in interleave
/home/flame/devel/repos/git/libvirt/tests/xmconfigdata/test-fullvirt-old-cdrom.xml:21: element devices: Relax-NG validity error : Element domain failed to validate content
/home/flame/devel/repos/git/libvirt/tests/xmconfigdata/test-fullvirt-old-cdrom.xml fails to validate
 136) xmconfigdata/test-fullvirt-usbtablet-no-bus.xml  FAILED
xmllint --relaxng ./../docs/schemas/domain.rng --noout /home/flame/devel/repos/git/libvirt/tests/xmconfigdata/test-fullvirt-usbtablet-no-bus.xml
Relax-NG validity error : Extra element devices in interleave
/home/flame/devel/repos/git/libvirt/tests/xmconfigdata/test-fullvirt-usbtablet-no-bus.xml:21: element devices: Relax-NG validity error : Element domain failed to validate content
/home/flame/devel/repos/git/libvirt/tests/xmconfigdata/test-fullvirt-usbtablet-no-bus.xml fails to validate
 137) xmconfigdata/test-paravirt-net-vifname.xml  FAILED
xmllint --relaxng ./../docs/schemas/domain.rng --noout /home/flame/devel/repos/git/libvirt/tests/xmconfigdata/test-paravirt-net-vifname.xml
Relax-NG validity error : Extra element devices in interleave
/home/flame/devel/repos/git/libvirt/tests/xmconfigdata/test-paravirt-net-vifname.xml:15: element devices: Relax-NG validity error : Element domain failed to validate content
/home/flame/devel/repos/git/libvirt/tests/xmconfigdata/test-paravirt-net-vifname.xml fails to validate
 138) xmconfigdata/test-fullvirt-serial-udp.xml  FAILED
xmllint --relaxng ./../docs/schemas/domain.rng --noout /home/flame/devel/repos/git/libvirt/tests/xmconfigdata/test-fullvirt-serial-udp.xml
Relax-NG validity error : Extra element devices in interleave
/home/flame/devel/repos/git/libvirt/tests/xmconfigdata/test-fullvirt-serial-udp.xml:21: element devices: Relax-NG validity error : Element domain failed to validate content
/home/flame/devel/repos/git/libvirt/tests/xmconfigdata/test-fullvirt-serial-udp.xml fails to validate
 139) xmconfigdata/test-pci-devs.xml  OK
 140) xmconfigdata/test-fullvirt-serial-pty.xml  FAILED
xmllint --relaxng ./../docs/schemas/domain.rng --noout /home/flame/devel/repos/git/libvirt/tests/xmconfigdata/test-fullvirt-serial-pty.xml
Relax-NG validity error : Extra element devices in interleave
/home/flame/devel/repos/git/libvirt/tests/xmconfigdata/test-fullvirt-serial-pty.xml:21: element devices: Relax-NG validity error : Element domain failed to validate content
/home/flame/devel/repos/git/libvirt/tests/xmconfigdata/test-fullvirt-serial-pty.xml fails to validate
 141) xmconfigdata/test-fullvirt-net-netfront.xml  FAILED
xmllint --relaxng ./../docs/schemas/domain.rng --noout /home/flame/devel/repos/git/libvirt/tests/xmconfigdata/test-fullvirt-net-netfront.xml
Relax-NG validity error : Extra element devices in interleave
/home/flame/devel/repos/git/libvirt/tests/xmconfigdata/test-fullvirt-net-netfront.xml:21: element devices: Relax-NG validity error : Element domain failed to validate content
/home/flame/devel/repos/git/libvirt/tests/xmconfigdata/test-fullvirt-net-netfront.xml fails to validate
 142) xmconfigdata/test-fullvirt-new-cdrom.xml  FAILED
xmllint --relaxng ./../docs/schemas/domain.rng --noout /home/flame/devel/repos/git/libvirt/tests/xmconfigdata/test-fullvirt-new-cdrom.xml
Relax-NG validity error : Extra element devices in interleave
/home/flame/devel/repos/git/libvirt/tests/xmconfigdata/test-fullvirt-new-cdrom.xml:21: element devices: Relax-NG validity error : Element domain failed to validate content
/home/flame/devel/repos/git/libvirt/tests/xmconfigdata/test-fullvirt-new-cdrom.xml fails to validate
 143) xmconfigdata/test-no-source-cdrom.xml  OK
 144) xmconfigdata/test-fullvirt-localtime.xml  FAILED
xmllint --relaxng ./../docs/schemas/domain.rng --noout /home/flame/devel/repos/git/libvirt/tests/xmconfigdata/test-fullvirt-localtime.xml
Relax-NG validity error : Extra element devices in interleave
/home/flame/devel/repos/git/libvirt/tests/xmconfigdata/test-fullvirt-localtime.xml:21: element devices: Relax-NG validity error : Element domain failed to validate content
/home/flame/devel/repos/git/libvirt/tests/xmconfigdata/test-fullvirt-localtime.xml fails to validate
 145) xmconfigdata/test-paravirt-old-pvfb-vncdisplay.xml  FAILED
xmllint --relaxng ./../docs/schemas/domain.rng --noout /home/flame/devel/repos/git/libvirt/tests/xmconfigdata/test-paravirt-old-pvfb-vncdisplay.xml
Relax-NG validity error : Extra element devices in interleave
/home/flame/devel/repos/git/libvirt/tests/xmconfigdata/test-paravirt-old-pvfb-vncdisplay.xml:15: element devices: Relax-NG validity error : Element domain failed to validate content
/home/flame/devel/repos/git/libvirt/tests/xmconfigdata/test-paravirt-old-pvfb-vncdisplay.xml fails to validate
 146) xmconfigdata/test-fullvirt-net-ioemu.xml  FAILED
xmllint --relaxng ./../docs/schemas/domain.rng --noout /home/flame/devel/repos/git/libvirt/tests/xmconfigdata/test-fullvirt-net-ioemu.xml
Relax-NG validity error : Extra element devices in interleave
/home/flame/devel/repos/git/libvirt/tests/xmconfigdata/test-fullvirt-net-ioemu.xml:21: element devices: Relax-NG validity error : Element domain failed to validate content
/home/flame/devel/repos/git/libvirt/tests/xmconfigdata/test-fullvirt-net-ioemu.xml fails to validate
 147) xmconfigdata/test-fullvirt-serial-pipe.xml  FAILED
xmllint --relaxng ./../docs/schemas/domain.rng --noout /home/flame/devel/repos/git/libvirt/tests/xmconfigdata/test-fullvirt-serial-pipe.xml
Relax-NG validity error : Extra element devices in interleave
/home/flame/devel/repos/git/libvirt/tests/xmconfigdata/test-fullvirt-serial-pipe.xml:21: element devices: Relax-NG validity error : Element domain failed to validate content
/home/flame/devel/repos/git/libvirt/tests/xmconfigdata/test-fullvirt-serial-pipe.xml fails to validate
 148) xmconfigdata/test-fullvirt-sound.xml  FAILED
xmllint --relaxng ./../docs/schemas/domain.rng --noout /home/flame/devel/repos/git/libvirt/tests/xmconfigdata/test-fullvirt-sound.xml
Relax-NG validity error : Extra element devices in interleave
/home/flame/devel/repos/git/libvirt/tests/xmconfigdata/test-fullvirt-sound.xml:21: element devices: Relax-NG validity error : Element domain failed to validate content
/home/flame/devel/repos/git/libvirt/tests/xmconfigdata/test-fullvirt-sound.xml fails to validate
 149) xml2sexprdata/xml2sexpr-bridge-ipaddr.xml  FAILED
xmllint --relaxng ./../docs/schemas/domain.rng --noout /home/flame/devel/repos/git/libvirt/tests/xml2sexprdata/xml2sexpr-bridge-ipaddr.xml
Relax-NG validity error : Extra element devices in interleave
/home/flame/devel/repos/git/libvirt/tests/xml2sexprdata/xml2sexpr-bridge-ipaddr.xml:1: element domain: Relax-NG validity error : Element domain failed to validate content
/home/flame/devel/repos/git/libvirt/tests/xml2sexprdata/xml2sexpr-bridge-ipaddr.xml fails to validate
 150) xml2sexprdata/xml2sexpr-fv-usbmouse.xml  OK
 151) xml2sexprdata/xml2sexpr-disk-block-shareable.xml  OK
 152) xml2sexprdata/xml2sexpr-fv.xml  OK
 153) xml2sexprdata/xml2sexpr-fv-serial-tcp-telnet.xml  OK
 154) xml2sexprdata/xml2sexpr-fv-serial-null.xml  OK
 155) xml2sexprdata/xml2sexpr-fv-serial-pty.xml  OK
 156) xml2sexprdata/xml2sexpr-fv-net-ioemu.xml  OK
 157) xml2sexprdata/xml2sexpr-pci-devs.xml  OK
 158) xml2sexprdata/xml2sexpr-fv-serial-udp.xml  OK
 159) xml2sexprdata/xml2sexpr-pv-vfb-new-auto.xml  FAILED
xmllint --relaxng ./../docs/schemas/domain.rng --noout /home/flame/devel/repos/git/libvirt/tests/xml2sexprdata/xml2sexpr-pv-vfb-new-auto.xml
Relax-NG validity error : Extra element devices in interleave
/home/flame/devel/repos/git/libvirt/tests/xml2sexprdata/xml2sexpr-pv-vfb-new-auto.xml:1: element domain: Relax-NG validity error : Element domain failed to validate content
/home/flame/devel/repos/git/libvirt/tests/xml2sexprdata/xml2sexpr-pv-vfb-new-auto.xml fails to validate
 160) xml2sexprdata/xml2sexpr-disk-file.xml  OK
 161) xml2sexprdata/xml2sexpr-fv-usbtablet.xml  OK
 162) xml2sexprdata/xml2sexpr-disk-block.xml  OK
 163) xml2sexprdata/xml2sexpr-fv-parallel-tcp.xml  OK
 164) xml2sexprdata/xml2sexpr-disk-drv-loop.xml  OK
 165) xml2sexprdata/xml2sexpr-disk-drv-blktap-raw.xml  OK
 166) xml2sexprdata/xml2sexpr-pv.xml  OK
 167) xml2sexprdata/xml2sexpr-pv-bootloader.xml  OK
 168) xml2sexprdata/xml2sexpr-no-source-cdrom.xml  OK
 169) xml2sexprdata/xml2sexpr-disk-drv-blkback.xml  OK
 170) xml2sexprdata/xml2sexpr-fv-localtime.xml  OK
 171) xml2sexprdata/xml2sexpr-fv-utc.xml  OK
 172) xml2sexprdata/xml2sexpr-disk-drv-blktap-qcow.xml  OK
 173) xml2sexprdata/xml2sexpr-disk-drv-blktap.xml  OK
 174) xml2sexprdata/xml2sexpr-net-e1000.xml  OK
 175) xml2sexprdata/xml2sexpr-fv-net-netfront.xml  OK
 176) xml2sexprdata/xml2sexpr-net-bridged.xml  OK
 177) xml2sexprdata/xml2sexpr-fv-kernel.xml  OK
 178) xml2sexprdata/xml2sexpr-fv-serial-stdio.xml  OK
 179) xml2sexprdata/xml2sexpr-net-routed.xml  FAILED
xmllint --relaxng ./../docs/schemas/domain.rng --noout /home/flame/devel/repos/git/libvirt/tests/xml2sexprdata/xml2sexpr-net-routed.xml
Relax-NG validity error : Extra element devices in interleave
/home/flame/devel/repos/git/libvirt/tests/xml2sexprdata/xml2sexpr-net-routed.xml:1: element domain: Relax-NG validity error : Element domain failed to validate content
/home/flame/devel/repos/git/libvirt/tests/xml2sexprdata/xml2sexpr-net-routed.xml fails to validate
 180) xml2sexprdata/xml2sexpr-fv-serial-pipe.xml  OK
 181) xml2sexprdata/xml2sexpr-fv-serial-tcp.xml  OK
 182) xml2sexprdata/xml2sexpr-fv-serial-unix.xml  OK
 183) xml2sexprdata/xml2sexpr-fv-sound.xml  OK
 184) xml2sexprdata/xml2sexpr-curmem.xml  OK
 185) xml2sexprdata/xml2sexpr-fv-vncunused.xml  OK
 186) xml2sexprdata/xml2sexpr-pv-vfb-orig.xml  FAILED
xmllint --relaxng ./../docs/schemas/domain.rng --noout /home/flame/devel/repos/git/libvirt/tests/xml2sexprdata/xml2sexpr-pv-vfb-orig.xml
Relax-NG validity error : Extra element devices in interleave
/home/flame/devel/repos/git/libvirt/tests/xml2sexprdata/xml2sexpr-pv-vfb-orig.xml:1: element domain: Relax-NG validity error : Element domain failed to validate content
/home/flame/devel/repos/git/libvirt/tests/xml2sexprdata/xml2sexpr-pv-vfb-orig.xml fails to validate
 187) xml2sexprdata/xml2sexpr-pv-vfb-new.xml  FAILED
xmllint --relaxng ./../docs/schemas/domain.rng --noout /home/flame/devel/repos/git/libvirt/tests/xml2sexprdata/xml2sexpr-pv-vfb-new.xml
Relax-NG validity error : Extra element devices in interleave
/home/flame/devel/repos/git/libvirt/tests/xml2sexprdata/xml2sexpr-pv-vfb-new.xml:1: element domain: Relax-NG validity error : Element domain failed to validate content
/home/flame/devel/repos/git/libvirt/tests/xml2sexprdata/xml2sexpr-pv-vfb-new.xml fails to validate
 188) xml2sexprdata/xml2sexpr-fv-serial-file.xml  OK
 189) xml2sexprdata/xml2sexpr-pv-localtime.xml  OK
Validated 189 files, 41 failed
FAIL: domainschematest
   1) nodedevschemadata/usb_device_1d6b_1_0000_00_1d_0.xml  OK
   2) nodedevschemadata/pci_8086_27c5_scsi_host_scsi_device_lun0.x  OK
   3) nodedevschemadata/pci_8086_27c5_scsi_host.xml  OK
   4) nodedevschemadata/computer.xml  OK
   5) nodedevschemadata/usb_device_1d6b_1_0000_00_1d_0_if0.xml  OK
   6) nodedevschemadata/pci_8086_27c5_scsi_host_0.xml  OK
   7) nodedevschemadata/pci_1002_71c4.xml  OK
   8) nodedevschemadata/storage_serial_SATA_HTS721010G9SA00_MPCZ12  OK
   9) nodedevschemadata/DVD_GCC_4247N.xml  OK
  10) nodedevschemadata/storage_serial_3600c0ff000d7a2a5d463ff4902  OK
  11) nodedevschemadata/pci_8086_27c5_scsi_host_scsi_host.xml  OK
  12) nodedevschemadata/net_00_15_58_2f_e9_55.xml  OK
  13) nodedevschemadata/net_00_13_02_b9_f9_d3.xml  OK
  14) nodedevschemadata/DVD_with_media.xml  OK
Validated 14 files, 0 failed
PASS: nodedevschematest
 1) fc4.conf                                                          ... OK
 2) libvirtd.conf                                                     ... OK
PASS: test_conf.sh
PASS: cpuset
testing with corrupted config: listen_tls
testing with corrupted config: listen_tcp
testing with corrupted config: tls_port
testing with corrupted config: tcp_port
testing with corrupted config: listen_addr
testing with corrupted config: mdns_adv
testing with corrupted config: mdns_name
testing with corrupted config: unix_sock_group
testing with corrupted config: unix_sock_ro_perms
testing with corrupted config: unix_sock_rw_perms
testing with corrupted config: unix_sock_dir
testing with corrupted config: auth_unix_ro
testing with corrupted config: auth_unix_rw
testing with corrupted config: auth_tcp
testing with corrupted config: auth_tls
testing with corrupted config: key_file
testing with corrupted config: cert_file
testing with corrupted config: ca_file
testing with corrupted config: crl_file
testing with corrupted config: tls_no_verify_certificate
testing with corrupted config: tls_allowed_dn_list
testing with corrupted config: sasl_allowed_username_list
testing with corrupted config: max_clients
testing with corrupted config: min_workers
testing with corrupted config: max_workers
testing with corrupted config: max_requests
testing with corrupted config: max_client_requests
testing with corrupted config: log_level
running libvirtd with a valid config file (2 seconds)
./daemon-conf: line 82: kill: (18051) - No such process
FAIL: daemon-conf
PASS: define-dev-segfault
PASS: int-overflow
PASS: libvirtd-fail
PASS: libvirtd-pool
PASS: read-bufsiz
PASS: read-non-seekable
PASS: start
PASS: undefine
PASS: vcpupin
testing help...
testing attach-device...
testing attach-disk...
testing attach-interface...
testing autostart...
testing capabilities...
testing cd...
testing connect...
testing console...
testing cpu-compare...
testing create...
testing start...
testing destroy...
testing detach-device...
testing detach-disk...
testing detach-interface...
testing define...
testing domid...
testing domuuid...
testing dominfo...
testing domname...
testing domstate...
testing domblkstat...
testing domifstat...
testing dommemstat...
testing domxml-from-native...
testing domxml-to-native...
testing dumpxml...
testing edit...
testing find-storage-pool-sources...
testing find-storage-pool-sources-as...
testing freecell...
testing hostname...
testing list...
testing migrate...
testing net-autostart...
testing net-create...
testing net-define...
testing net-destroy...
testing net-dumpxml...
testing net-edit...
testing net-list...
testing net-name...
testing net-start...
testing net-undefine...
testing net-uuid...
testing iface-list...
testing iface-name...
testing iface-mac...
testing iface-dumpxml...
testing iface-define...
testing iface-undefine...
testing iface-edit...
testing iface-start...
testing iface-destroy...
testing nodeinfo...
testing nodedev-list...
testing nodedev-dumpxml...
testing nodedev-dettach...
testing nodedev-reattach...
testing nodedev-reset...
testing nodedev-create...
testing nodedev-destroy...
testing pool-autostart...
testing pool-build...
testing pool-create...
testing pool-create-as...
testing pool-define...
testing pool-define-as...
testing pool-destroy...
testing pool-delete...
testing pool-dumpxml...
testing pool-edit...
testing pool-info...
testing pool-list...
testing pool-name...
testing pool-refresh...
testing pool-start...
testing pool-undefine...
testing pool-uuid...
testing secret-define...
testing secret-dumpxml...
testing secret-set-value...
testing secret-get-value...
testing secret-undefine...
testing secret-list...
testing pwd...
testing quit...
testing reboot...
testing restore...
testing resume...
testing save...
testing schedinfo...
testing dump...
testing shutdown...
testing setmem...
testing setmaxmem...
testing setvcpus...
testing suspend...
testing ttyconsole...
testing undefine...
testing uri...
testing vol-create...
testing vol-create-from...
testing vol-create-as...
testing vol-clone...
testing vol-delete...
testing vol-dumpxml...
testing vol-info...
testing vol-list...
testing vol-path...
testing vol-name...
testing vol-key...
testing vcpuinfo...
testing vcpupin...
testing version...
testing vncdisplay...
PASS: virsh-all
PASS: virsh-synopsis
 1) QEMU XML-2-ARGV minimal                                           ... OK
 2) QEMU XML-2-ARGV machine-aliases1                                  ... OK
 3) QEMU XML-2-ARGV machine-aliases2                                  ... OK
 4) QEMU XML-2-ARGV boot-cdrom                                        ... OK
 5) QEMU XML-2-ARGV boot-network                                      ... OK
 6) QEMU XML-2-ARGV boot-floppy                                       ... OK
 7) QEMU XML-2-ARGV bootloader                                        ... OK
 8) QEMU XML-2-ARGV clock-utc                                         ... OK
 9) QEMU XML-2-ARGV clock-localtime                                   ... OK
10) QEMU XML-2-ARGV hugepages                                         ... OK
11) QEMU XML-2-ARGV disk-cdrom                                        ... OK
12) QEMU XML-2-ARGV disk-cdrom-empty                                  ... OK
13) QEMU XML-2-ARGV disk-floppy                                       ... OK
14) QEMU XML-2-ARGV disk-many                                         ... OK
15) QEMU XML-2-ARGV disk-virtio                                       ... OK
16) QEMU XML-2-ARGV disk-xenvbd                                       ... OK
17) QEMU XML-2-ARGV disk-drive-boot-disk                              ... OK
18) QEMU XML-2-ARGV disk-drive-boot-cdrom                             ... OK
19) QEMU XML-2-ARGV floppy-drive-fat                                  ... OK
20) QEMU XML-2-ARGV disk-drive-fat                                    ... OK
21) QEMU XML-2-ARGV disk-drive-fmt-qcow                               ... OK
22) QEMU XML-2-ARGV disk-drive-shared                                 ... OK
23) QEMU XML-2-ARGV disk-drive-cache-v1-wt                            ... OK
24) QEMU XML-2-ARGV disk-drive-cache-v1-wb                            ... OK
25) QEMU XML-2-ARGV disk-drive-cache-v1-none                          ... OK
26) QEMU XML-2-ARGV disk-drive-cache-v2-wt                            ... OK
27) QEMU XML-2-ARGV disk-drive-cache-v2-wb                            ... OK
28) QEMU XML-2-ARGV disk-drive-cache-v2-none                          ... OK
29) QEMU XML-2-ARGV disk-usb                                          ... OK
30) QEMU XML-2-ARGV graphics-vnc                                      ... OK
31) QEMU XML-2-ARGV graphics-vnc-sasl                                 ... OK
32) QEMU XML-2-ARGV graphics-vnc-tls                                  ... OK
33) QEMU XML-2-ARGV graphics-sdl                                      ... FAILED
34) QEMU XML-2-ARGV graphics-sdl-fullscreen                           ... FAILED
35) QEMU XML-2-ARGV input-usbmouse                                    ... OK
36) QEMU XML-2-ARGV input-usbtablet                                   ... OK
37) QEMU XML-2-ARGV input-xen                                         ... OK
38) QEMU XML-2-ARGV misc-acpi                                         ... OK
39) QEMU XML-2-ARGV misc-no-reboot                                    ... OK
40) QEMU XML-2-ARGV misc-uuid                                         ... OK
41) QEMU XML-2-ARGV net-user                                          ... OK
42) QEMU XML-2-ARGV net-virtio                                        ... OK
43) QEMU XML-2-ARGV net-eth                                           ... OK
44) QEMU XML-2-ARGV net-eth-ifname                                    ... OK
45) QEMU XML-2-ARGV net-eth-names                                     ... OK
46) QEMU XML-2-ARGV serial-vc                                         ... OK
47) QEMU XML-2-ARGV serial-pty                                        ... OK
48) QEMU XML-2-ARGV serial-dev                                        ... OK
49) QEMU XML-2-ARGV serial-file                                       ... OK
50) QEMU XML-2-ARGV serial-unix                                       ... OK
51) QEMU XML-2-ARGV serial-tcp                                        ... OK
52) QEMU XML-2-ARGV serial-udp                                        ... OK
53) QEMU XML-2-ARGV serial-tcp-telnet                                 ... OK
54) QEMU XML-2-ARGV serial-many                                       ... OK
55) QEMU XML-2-ARGV parallel-tcp                                      ... OK
56) QEMU XML-2-ARGV console-compat                                    ... OK
57) QEMU XML-2-ARGV serial-vc-chardev                                 ... OK
58) QEMU XML-2-ARGV serial-pty-chardev                                ... OK
59) QEMU XML-2-ARGV serial-dev-chardev                                ... OK
60) QEMU XML-2-ARGV serial-file-chardev                               ... OK
61) QEMU XML-2-ARGV serial-unix-chardev                               ... OK
62) QEMU XML-2-ARGV serial-tcp-chardev                                ... OK
63) QEMU XML-2-ARGV serial-udp-chardev                                ... OK
64) QEMU XML-2-ARGV serial-tcp-telnet-chardev                         ... OK
65) QEMU XML-2-ARGV serial-many-chardev                               ... OK
66) QEMU XML-2-ARGV parallel-tcp-chardev                              ... OK
67) QEMU XML-2-ARGV console-compat-chardev                            ... OK
68) QEMU XML-2-ARGV channel-guestfwd                                  ... OK
69) QEMU XML-2-ARGV sound                                             ... OK
70) QEMU XML-2-ARGV hostdev-usb-product                               ... OK
71) QEMU XML-2-ARGV hostdev-usb-address                               ... OK
72) QEMU XML-2-ARGV hostdev-pci-address                               ... OK
73) QEMU XML-2-ARGV restore-v1                                        ... OK
74) QEMU XML-2-ARGV restore-v2                                        ... OK
75) QEMU XML-2-ARGV restore-v2                                        ... OK
76) QEMU XML-2-ARGV migrate                                           ... OK
FAIL: qemuxml2argvtest
 1) QEMU XML-2-XML minimal                                            ... OK
 2) QEMU XML-2-XML boot-cdrom                                         ... OK
 3) QEMU XML-2-XML boot-network                                       ... OK
 4) QEMU XML-2-XML boot-floppy                                        ... OK
 5) QEMU XML-2-XML bootloader                                         ... OK
 6) QEMU XML-2-XML clock-utc                                          ... OK
 7) QEMU XML-2-XML clock-localtime                                    ... OK
 8) QEMU XML-2-XML hugepages                                          ... OK
 9) QEMU XML-2-XML disk-cdrom                                         ... OK
10) QEMU XML-2-XML disk-floppy                                        ... OK
11) QEMU XML-2-XML disk-many                                          ... OK
12) QEMU XML-2-XML disk-xenvbd                                        ... OK
13) QEMU XML-2-XML disk-usb                                           ... OK
14) QEMU XML-2-XML floppy-drive-fat                                   ... OK
15) QEMU XML-2-XML disk-drive-fat                                     ... OK
16) QEMU XML-2-XML disk-drive-fmt-qcow                                ... OK
17) QEMU XML-2-XML disk-drive-cache-v1-wt                             ... OK
18) QEMU XML-2-XML disk-drive-cache-v1-wb                             ... OK
19) QEMU XML-2-XML disk-drive-cache-v1-none                           ... OK
20) QEMU XML-2-XML graphics-vnc                                       ... OK
21) QEMU XML-2-XML graphics-vnc-sasl                                  ... OK
22) QEMU XML-2-XML graphics-vnc-tls                                   ... OK
23) QEMU XML-2-XML graphics-sdl                                       ... OK
24) QEMU XML-2-XML graphics-sdl-fullscreen                            ... OK
25) QEMU XML-2-XML input-usbmouse                                     ... OK
26) QEMU XML-2-XML input-usbtablet                                    ... OK
27) QEMU XML-2-XML input-xen                                          ... OK
28) QEMU XML-2-XML misc-acpi                                          ... OK
29) QEMU XML-2-XML misc-no-reboot                                     ... OK
30) QEMU XML-2-XML net-user                                           ... OK
31) QEMU XML-2-XML net-virtio                                         ... OK
32) QEMU XML-2-XML net-eth                                            ... OK
33) QEMU XML-2-XML net-eth-ifname                                     ... OK
34) QEMU XML-2-XML sound                                              ... OK
35) QEMU XML-2-XML serial-vc                                          ... OK
36) QEMU XML-2-XML serial-pty                                         ... OK
37) QEMU XML-2-XML serial-dev                                         ... OK
38) QEMU XML-2-XML serial-file                                        ... OK
39) QEMU XML-2-XML serial-unix                                        ... OK
40) QEMU XML-2-XML serial-tcp                                         ... OK
41) QEMU XML-2-XML serial-udp                                         ... OK
42) QEMU XML-2-XML serial-tcp-telnet                                  ... OK
43) QEMU XML-2-XML serial-many                                        ... OK
44) QEMU XML-2-XML parallel-tcp                                       ... OK
45) QEMU XML-2-XML console-compat                                     ... OK
46) QEMU XML-2-XML channel-guestfwd                                   ... OK
47) QEMU XML-2-XML hostdev-usb-product                                ... OK
48) QEMU XML-2-XML hostdev-usb-address                                ... OK
49) QEMU XML-2-XML hostdev-pci-address                                ... OK
PASS: qemuxml2xmltest
 1) QEMU ARGV-2-XML boot-cdrom                                        ... OK
 2) QEMU ARGV-2-XML boot-network                                      ... OK
 3) QEMU ARGV-2-XML boot-floppy                                       ... OK
 4) QEMU ARGV-2-XML clock-utc                                         ... OK
 5) QEMU ARGV-2-XML clock-localtime                                   ... OK
 6) QEMU ARGV-2-XML disk-cdrom                                        ... OK
 7) QEMU ARGV-2-XML disk-cdrom-empty                                  ... OK
 8) QEMU ARGV-2-XML disk-floppy                                       ... OK
 9) QEMU ARGV-2-XML disk-many                                         ... OK
10) QEMU ARGV-2-XML disk-virtio                                       ... OK
11) QEMU ARGV-2-XML disk-xenvbd                                       ... OK
12) QEMU ARGV-2-XML disk-drive-boot-disk                              ... OK
13) QEMU ARGV-2-XML disk-drive-boot-cdrom                             ... OK
14) QEMU ARGV-2-XML disk-drive-fmt-qcow                               ... OK
15) QEMU ARGV-2-XML disk-drive-cache-v1-wb                            ... OK
16) QEMU ARGV-2-XML disk-drive-cache-v1-none                          ... OK
17) QEMU ARGV-2-XML disk-drive-cache-v2-wt                            ... OK
18) QEMU ARGV-2-XML disk-drive-cache-v2-wb                            ... OK
19) QEMU ARGV-2-XML disk-drive-cache-v2-none                          ... OK
20) QEMU ARGV-2-XML disk-usb                                          ... OK
21) QEMU ARGV-2-XML graphics-vnc                                      ... OK
22) QEMU ARGV-2-XML graphics-vnc-sasl                                 ... OK
23) QEMU ARGV-2-XML graphics-vnc-tls                                  ... OK
24) QEMU ARGV-2-XML graphics-sdl                                      ... OK
25) QEMU ARGV-2-XML graphics-sdl-fullscreen                           ... OK
26) QEMU ARGV-2-XML input-usbmouse                                    ... OK
27) QEMU ARGV-2-XML input-usbtablet                                   ... OK
28) QEMU ARGV-2-XML misc-acpi                                         ... OK
29) QEMU ARGV-2-XML misc-no-reboot                                    ... OK
30) QEMU ARGV-2-XML misc-uuid                                         ... OK
31) QEMU ARGV-2-XML net-user                                          ... OK
32) QEMU ARGV-2-XML net-virtio                                        ... OK
33) QEMU ARGV-2-XML net-eth                                           ... OK
34) QEMU ARGV-2-XML net-eth-ifname                                    ... OK
35) QEMU ARGV-2-XML serial-vc                                         ... OK
36) QEMU ARGV-2-XML serial-pty                                        ... OK
37) QEMU ARGV-2-XML serial-dev                                        ... OK
38) QEMU ARGV-2-XML serial-file                                       ... OK
39) QEMU ARGV-2-XML serial-unix                                       ... OK
40) QEMU ARGV-2-XML serial-tcp                                        ... OK
41) QEMU ARGV-2-XML serial-udp                                        ... OK
42) QEMU ARGV-2-XML serial-tcp-telnet                                 ... OK
43) QEMU ARGV-2-XML serial-many                                       ... OK
44) QEMU ARGV-2-XML parallel-tcp                                      ... OK
45) QEMU ARGV-2-XML console-compat                                    ... OK
46) QEMU ARGV-2-XML sound                                             ... OK
47) QEMU ARGV-2-XML watchdog                                          ... OK
48) QEMU ARGV-2-XML hostdev-usb-product                               ... OK
49) QEMU ARGV-2-XML hostdev-usb-address                               ... OK
50) QEMU ARGV-2-XML hostdev-pci-address                               ... OK
51) QEMU ARGV-2-XML restore-v1                                        ... OK
52) QEMU ARGV-2-XML restore-v2                                        ... OK
53) QEMU ARGV-2-XML restore-v2                                        ... OK
54) QEMU ARGV-2-XML migrate                                           ... OK
PASS: qemuargv2xmltest
 1) QEMU Help String Parsing qemu-0.9.1                               ... OK
 2) QEMU Help String Parsing kvm-74                                   ... OK
 3) QEMU Help String Parsing qemu-0.10.5                              ... OK
 4) QEMU Help String Parsing qemu-kvm-0.10.5                          ... OK
 5) QEMU Help String Parsing kvm-86                                   ... OK
 6) QEMU Help String Parsing qemu-kvm-0.11.0-rc2                      ... OK
PASS: qemuhelptest
 1) VMware IndexToDiskName                                            ... OK
 2) VMware DiskNameToIndex                                            ... OK
 3) VMware ParseDatastoreRelatedPath                                  ... OK
PASS: esxutilstest
 1) VMware VMX-2-XML minimal -> minimal                               ... OK
 2) VMware VMX-2-XML minimal-64bit -> minimal-64bit                   ... OK
 3) VMware VMX-2-XML scsi-buslogic -> scsi-buslogic                   ... OK
 4) VMware VMX-2-XML scsi-writethrough -> scsi-writethrough           ... OK
 5) VMware VMX-2-XML harddisk-scsi-file -> harddisk-scsi-file         ... OK
 6) VMware VMX-2-XML harddisk-ide-file -> harddisk-ide-file           ... OK
 7) VMware VMX-2-XML cdrom-scsi-file -> cdrom-scsi-file               ... OK
 8) VMware VMX-2-XML cdrom-scsi-device -> cdrom-scsi-device           ... OK
 9) VMware VMX-2-XML cdrom-ide-file -> cdrom-ide-file                 ... OK
10) VMware VMX-2-XML cdrom-ide-device -> cdrom-ide-device             ... OK
11) VMware VMX-2-XML floppy-file -> floppy-file                       ... OK
12) VMware VMX-2-XML floppy-device -> floppy-device                   ... OK
13) VMware VMX-2-XML ethernet-e1000 -> ethernet-e1000                 ... OK
14) VMware VMX-2-XML ethernet-custom -> ethernet-custom               ... OK
15) VMware VMX-2-XML ethernet-bridged -> ethernet-bridged             ... OK
16) VMware VMX-2-XML serial-file -> serial-file                       ... OK
17) VMware VMX-2-XML serial-device -> serial-device                   ... OK
18) VMware VMX-2-XML serial-pipe-client-app -> serial-pipe            ... OK
19) VMware VMX-2-XML serial-pipe-server-vm -> serial-pipe             ... OK
20) VMware VMX-2-XML serial-pipe-client-app -> serial-pipe            ... OK
21) VMware VMX-2-XML serial-pipe-server-vm -> serial-pipe             ... OK
22) VMware VMX-2-XML parallel-file -> parallel-file                   ... OK
23) VMware VMX-2-XML parallel-device -> parallel-device               ... OK
24) VMware VMX-2-XML esx-in-the-wild-1 -> esx-in-the-wild-1           ... OK
25) VMware VMX-2-XML esx-in-the-wild-2 -> esx-in-the-wild-2           ... OK
26) VMware VMX-2-XML esx-in-the-wild-3 -> esx-in-the-wild-3           ... OK
27) VMware VMX-2-XML esx-in-the-wild-4 -> esx-in-the-wild-4           ... OK
28) VMware VMX-2-XML gsx-in-the-wild-1 -> gsx-in-the-wild-1           ... OK
29) VMware VMX-2-XML gsx-in-the-wild-2 -> gsx-in-the-wild-2           ... OK
30) VMware VMX-2-XML gsx-in-the-wild-3 -> gsx-in-the-wild-3           ... OK
31) VMware VMX-2-XML gsx-in-the-wild-4 -> gsx-in-the-wild-4           ... OK
PASS: vmx2xmltest
 1) VMware XML-2-VMX minimal -> minimal                               ... OK
 2) VMware XML-2-VMX minimal-64bit -> minimal-64bit                   ... OK
 3) VMware XML-2-VMX scsi-buslogic -> scsi-buslogic                   ... OK
 4) VMware XML-2-VMX scsi-writethrough -> scsi-writethrough           ... OK
 5) VMware XML-2-VMX harddisk-scsi-file -> harddisk-scsi-file         ... OK
 6) VMware XML-2-VMX harddisk-ide-file -> harddisk-ide-file           ... OK
 7) VMware XML-2-VMX cdrom-scsi-file -> cdrom-scsi-file               ... OK
 8) VMware XML-2-VMX cdrom-scsi-device -> cdrom-scsi-device           ... OK
 9) VMware XML-2-VMX cdrom-ide-file -> cdrom-ide-file                 ... OK
10) VMware XML-2-VMX cdrom-ide-device -> cdrom-ide-device             ... OK
11) VMware XML-2-VMX floppy-file -> floppy-file                       ... OK
12) VMware XML-2-VMX floppy-device -> floppy-device                   ... OK
13) VMware XML-2-VMX ethernet-e1000 -> ethernet-e1000                 ... OK
14) VMware XML-2-VMX ethernet-custom -> ethernet-custom               ... OK
15) VMware XML-2-VMX ethernet-bridged -> ethernet-bridged             ... OK
16) VMware XML-2-VMX serial-file -> serial-file                       ... OK
17) VMware XML-2-VMX serial-device -> serial-device                   ... OK
18) VMware XML-2-VMX serial-pipe -> serial-pipe                       ... OK
19) VMware XML-2-VMX parallel-file -> parallel-file                   ... OK
20) VMware XML-2-VMX parallel-device -> parallel-device               ... OK
21) VMware XML-2-VMX esx-in-the-wild-1 -> esx-in-the-wild-1           ... OK
22) VMware XML-2-VMX esx-in-the-wild-2 -> esx-in-the-wild-2           ... OK
23) VMware XML-2-VMX esx-in-the-wild-3 -> esx-in-the-wild-3           ... OK
24) VMware XML-2-VMX esx-in-the-wild-4 -> esx-in-the-wild-4           ... OK
25) VMware XML-2-VMX gsx-in-the-wild-1 -> gsx-in-the-wild-1           ... OK
26) VMware XML-2-VMX gsx-in-the-wild-2 -> gsx-in-the-wild-2           ... OK
27) VMware XML-2-VMX gsx-in-the-wild-3 -> gsx-in-the-wild-3           ... OK
28) VMware XML-2-VMX gsx-in-the-wild-4 -> gsx-in-the-wild-4           ... OK
PASS: xml2vmxtest
 1: Simple write OK
 2: Deleted before poll OK
 3: Interrupted during poll OK
 4: Deleted during dispatch OK
 5: Deleted during dispatch OK
 6: Firing a timer OK
 7: Deleted before poll OK
 8: Interrupted during poll OK
 9: Deleted during dispatch OK
10: Deleted during dispatch OK
11: Write duplicate OK
PASS: eventtest
 1) Network XML-2-XML isolated-network                                ... OK
 2) Network XML-2-XML routed-network                                  ... OK
 3) Network XML-2-XML nat-network                                     ... OK
 4) Network XML-2-XML netboot-network                                 ... OK
 5) Network XML-2-XML netboot-proxy-network                           ... OK
PASS: networkxml2xmltest
 1) Storage Vol XML-2-XML vol-file                                    ... OK
 2) Storage Vol XML-2-XML vol-file-backing                            ... OK
 3) Storage Vol XML-2-XML vol-qcow2                                   ... OK
 4) Storage Vol XML-2-XML vol-partition                               ... OK
 5) Storage Vol XML-2-XML vol-logical                                 ... OK
 6) Storage Vol XML-2-XML vol-logical-backing                         ... OK
PASS: storagevolxml2xmltest
 1) Storage Pool XML-2-XML pool-dir                                   ... OK
 2) Storage Pool XML-2-XML pool-fs                                    ... OK
 3) Storage Pool XML-2-XML pool-logical                               ... OK
 4) Storage Pool XML-2-XML pool-logical-create                        ... OK
 5) Storage Pool XML-2-XML pool-disk                                  ... OK
 6) Storage Pool XML-2-XML pool-iscsi                                 ... OK
 7) Storage Pool XML-2-XML pool-iscsi-auth                            ... OK
 8) Storage Pool XML-2-XML pool-netfs                                 ... OK
 9) Storage Pool XML-2-XML pool-scsi                                  ... OK
10) Storage Pool XML-2-XML pool-mpath                                 ... OK
PASS: storagepoolxml2xmltest
 1) Node device XML-2-XML computer                                    ... OK
 2) Node device XML-2-XML DVD_GCC_4247N                               ... OK
 3) Node device XML-2-XML DVD_with_media                              ... OK
 4) Node device XML-2-XML net_00_13_02_b9_f9_d3                       ... OK
 5) Node device XML-2-XML net_00_15_58_2f_e9_55                       ... OK
 6) Node device XML-2-XML pci_1002_71c4                               ... OK
 7) Node device XML-2-XML pci_8086_27c5_scsi_host_0                   ... OK
 8) Node device XML-2-XML pci_8086_27c5_scsi_host_scsi_device_lun0    ... OK
 9) Node device XML-2-XML pci_8086_27c5_scsi_host_scsi_host           ... OK
10) Node device XML-2-XML pci_8086_27c5_scsi_host                     ... OK
11) Node device XML-2-XML storage_serial_SATA_HTS721010G9SA00_MPCZ12Y0GNGWSE ... OK
12) Node device XML-2-XML usb_device_1d6b_1_0000_00_1d_0_if0          ... OK
13) Node device XML-2-XML usb_device_1d6b_1_0000_00_1d_0              ... OK
PASS: nodedevxml2xmltest
 1) Interface XML-2-XML ethernet-dhcp                                 ... OK
 2) Interface XML-2-XML ethernet-static                               ... OK
 3) Interface XML-2-XML ethernet-static-no-prefix                     ... OK
 4) Interface XML-2-XML bridge                                        ... OK
 5) Interface XML-2-XML bridge42                                      ... OK
 6) Interface XML-2-XML bridge-vlan                                   ... OK
 7) Interface XML-2-XML bridge-no-address                             ... OK
 8) Interface XML-2-XML vlan                                          ... OK
 9) Interface XML-2-XML bond                                          ... OK
10) Interface XML-2-XML bond-arp                                      ... OK
PASS: interfacexml2xmltest
====================
4 of 38 tests failed
====================
make[3]: *** [check-TESTS] Error 1
make[2]: *** [check-am] Error 2
make[1]: *** [check-recursive] Error 1
make: *** [check-recursive] Error 1

[Date Prev][Date Next]   [Thread Prev][Thread Next]   [Thread Index] [Date Index] [Author Index]