[Date Prev][Date Next]   [Thread Prev][Thread Next]   [Thread Index] [Date Index] [Author Index]

[libvirt] libvirt: build error



Hi,

I’m getting the following error when I make libvirt version 0.7.4

 

Make all-recursive

make[1]: Entering directory `/home/sharadhap/libvirt-0.7.4'

Making all in gnulib/lib

make[2]: Entering directory `/home/sharadhap/libvirt-0.7.4/gnulib/lib'

make  all-recursive

make[3]: Entering directory `/home/sharadhap/libvirt-0.7.4/gnulib/lib'

make[4]: Entering directory `/home/sharadhap/libvirt-0.7.4/gnulib/lib'

/bin/sh ../../libtool --tag=CC   --mode=compile gcc -DHAVE_CONFIG_H -I. -I../..  -I../../intl   -g -O2 -MT printf-parse.lo -MD -MP -MF .deps/printf-parse.Tpo -c -o printf-parse.lo printf-parse.c

libtool: compile:  gcc -DHAVE_CONFIG_H -I. -I../.. -I../../intl -g -O2 -MT printf-parse.lo -MD -MP -MF .deps/printf-parse.Tpo -c printf-parse.c  -fPIC -DPIC -o .libs/printf-parse.o

In file included from printf-parse.c:70:

xsize.h: In function 'xsum':

xsize.h:59: error: expected _expression_ before ')' token

xsize.h:59: error: expected _expression_ before ')' token

printf-parse.c: In function 'printf_parse':

printf-parse.c:164: error: expected _expression_ before ')' token

printf-parse.c:164: error: expected _expression_ before ')' token

printf-parse.c:164: error: expected _expression_ before ')' token

printf-parse.c:164: error: expected _expression_ before ')' token

printf-parse.c:168: error: expected _expression_ before ')' token

printf-parse.c:168: error: expected _expression_ before ')' token

printf-parse.c:234: error: expected _expression_ before ')' token

printf-parse.c:234: error: expected _expression_ before ')' token

printf-parse.c:234: error: expected _expression_ before ')' token

printf-parse.c:234: error: expected _expression_ before ')' token

printf-parse.c:238: error: expected _expression_ before ')' token

printf-parse.c:238: error: expected _expression_ before ')' token

printf-parse.c:252: error: expected _expression_ before ')' token

printf-parse.c:252: error: expected _expression_ before ')' token

printf-parse.c:252: error: expected _expression_ before ')' token

printf-parse.c:252: error: expected _expression_ before ')' token

printf-parse.c:252: error: expected _expression_ before ')' token

printf-parse.c:252: error: expected _expression_ before ')' token

printf-parse.c:252: error: expected _expression_ before ')' token

printf-parse.c:252: error: expected _expression_ before ')' token

printf-parse.c:252: error: expected _expression_ before ')' token

printf-parse.c:252: error: expected _expression_ before ')' token

printf-parse.c:291: error: expected _expression_ before ')' token

printf-parse.c:291: error: expected _expression_ before ')' token

printf-parse.c:291: error: expected _expression_ before ')' token

printf-parse.c:291: error: expected _expression_ before ')' token

printf-parse.c:295: error: expected _expression_ before ')' token

printf-parse.c:295: error: expected _expression_ before ')' token

printf-parse.c:310: error: expected _expression_ before ')' token

printf-parse.c:310: error: expected _expression_ before ')' token

printf-parse.c:310: error: expected _expression_ before ')' token

printf-parse.c:310: error: expected _expression_ before ')' token

printf-parse.c:310: error: expected _expression_ before ')' token

printf-parse.c:310: error: expected _expression_ before ')' token

printf-parse.c:310: error: expected _expression_ before ')' token

printf-parse.c:310: error: expected _expression_ before ')' token

printf-parse.c:310: error: expected _expression_ before ')' token

printf-parse.c:310: error: expected _expression_ before ')' token

printf-parse.c:567: error: expected _expression_ before ')' token

printf-parse.c:567: error: expected _expression_ before ')' token

printf-parse.c:567: error: expected _expression_ before ')' token

printf-parse.c:567: error: expected _expression_ before ')' token

printf-parse.c:567: error: expected _expression_ before ')' token

printf-parse.c:567: error: expected _expression_ before ')' token

printf-parse.c:567: error: expected _expression_ before ')' token

printf-parse.c:567: error: expected _expression_ before ')' token

printf-parse.c:567: error: expected _expression_ before ')' token

printf-parse.c:567: error: expected _expression_ before ')' token

printf-parse.c:579: error: expected _expression_ before ')' token

printf-parse.c:579: error: expected _expression_ before ')' token

printf-parse.c:579: error: expected _expression_ before ')' token

printf-parse.c:579: error: expected _expression_ before ')' token

printf-parse.c:580: error: expected _expression_ before ')' token

printf-parse.c:580: error: expected _expression_ before ')' token

printf-parse.c:580: error: expected _expression_ before ')' token

printf-parse.c:580: error: expected _expression_ before ')' token

printf-parse.c:581: error: expected _expression_ before ')' token

printf-parse.c:581: error: expected _expression_ before ')' token

make[4]: *** [printf-parse.lo] Error 1

make[4]: Leaving directory `/home/sharadhap/libvirt-0.7.4/gnulib/lib'

make[3]: *** [all-recursive] Error 1

make[3]: Leaving directory `/home/sharadhap/libvirt-0.7.4/gnulib/lib'

make[2]: *** [all] Error 2

make[2]: Leaving directory `/home/sharadhap/libvirt-0.7.4/gnulib/lib'

make[1]: *** [all-recursive] Error 1

make[1]: Leaving directory `/home/sharadhap/libvirt-0.7.4'

make: *** [all] Error 2ake libvirt version 0.7.4

 

I’m using gcc version 4.3.2

Distro : Debian lenny 5

 

Could someone provide some help here?

-SP

 

 

 

 

 

 

 

 

 


[Date Prev][Date Next]   [Thread Prev][Thread Next]   [Thread Index] [Date Index] [Author Index]