[Date Prev][Date Next]   [Thread Prev][Thread Next]   [Thread Index] [Date Index] [Author Index]

Re: [libvirt] Initial working Mac OS X libvirt client build



Hi Justin,

On Thu, Oct 7, 2010 at 05:34, Justin Clift <jclift redhat com> wrote:
> On 09/22/2010 11:56 PM, Justin Clift wrote:
> <snip>
>
> As a follow up, our libvirt formula has been pulled into the
> upstream repository, and is now available on OSX to everyone using
> Homebrew:
>
>  http://mxcl.github.com/homebrew/

I thought I'd give it a try, to see how far I get on Leopard (10.5).

ranlib: file: .libs/libvirt_test.a(libvirt_util_la-bridge.o) has no symbols
ranlib: file: .libs/libvirt_test.a(libvirt_util_la-macvtap.o) has no symbols
ranlib: file: .libs/libvirt_test.a(libvirt_util_la-stats_linux.o) has no symbols
ranlib: file: .libs/libvirt_test.a(libvirt_driver_la-driver.o) has no symbols
ranlib: file: .libs/libvirt_test.a(close-hook.o) has no symbols
ranlib .libs/libvirt_test.a
ranlib: file: .libs/libvirt_test.a(libvirt_util_la-bridge.o) has no symbols
ranlib: file: .libs/libvirt_test.a(libvirt_util_la-macvtap.o) has no symbols
ranlib: file: .libs/libvirt_test.a(libvirt_util_la-stats_linux.o) has no symbols
ranlib: file: .libs/libvirt_test.a(libvirt_driver_la-driver.o) has no symbols
ranlib: file: .libs/libvirt_test.a(close-hook.o) has no symbols
rm -fr .libs/libvirt_test.lax
creating libvirt_test.la
(cd .libs && rm -f libvirt_test.la && ln -s ../libvirt_test.la libvirt_test.la)
make[2]: *** [all] Error 2
make[1]: *** [all-recursive] Error 1
make: *** [all] Error 2
Exit status: 2

http://github.com/mxcl/homebrew/blob/master/Library/Formula/libvirt.rb#L34

==> Environment
HOMEBREW_VERSION: 0.7
HEAD: b8490eda4bd66260521fad17140f1fa550f62c55
HOMEBREW_PREFIX: /usr/local
HOMEBREW_CELLAR: /usr/local/Cellar
HOMEBREW_REPOSITORY: /usr/local
HOMEBREW_LIBRARY_PATH: /usr/local/Library/Homebrew
Hardware: dual-core 64-bit penryn
OS X: 10.5.8
Kernel Architecture: i386
Ruby: 1.8.6-369
/usr/bin/ruby =>
/System/Library/Frameworks/Ruby.framework/Versions/1.8/usr/bin/ruby
Xcode: 3.1.4
GCC-4.0: build 5493
GCC-4.2: build 5577
LLVM: N/A
MacPorts or Fink? false
X11 installed? true

==> Build Flags
CC: /usr/bin/cc => /usr/bin/gcc-4.0
CXX: /usr/bin/c++ => /usr/bin/c++-4.0
LD: /usr/bin/cc => /usr/bin/gcc-4.0
CFLAGS: -O3 -march=nocona -mfpmath=sse -w -pipe
CXXFLAGS: -O3 -march=nocona -mfpmath=sse -w -pipe
MAKEFLAGS: -j2
Error: Failure while executing: make

Kind regards,

Ruben


[Date Prev][Date Next]   [Thread Prev][Thread Next]   [Thread Index] [Date Index] [Author Index]