[Date Prev][Date Next]   [Thread Prev][Thread Next]   [Thread Index] [Date Index] [Author Index]

[libvirt] 1 of 85 tests failed



hello send you result.
 

/usr/bin/make  check-TESTS
make[5]: Entering directory `/root/libvirt/libvirt-0.8.8/gnulib/tests'
PASS: test-alignof
PASS: test-alloca-opt
PASS: test-areadlink
PASS: test-arpa_inet
PASS: test-base64
PASS: test-binary-io.sh
PASS: test-c-ctype
PASS: test-canonicalize-lgpl
PASS: test-chown
PASS: test-count-one-bits
PASS: test-md5
PASS: test-environ
PASS: test-errno
PASS: test-fcntl-h
PASS: test-fseeko.sh
PASS: test-fseeko2.sh
PASS: test-func
PASS: test-getaddrinfo
PASS: test-getdelim
PASS: test-getgroups
PASS: test-gethostname
PASS: test-getline
PASS: test-gettimeofday
PASS: test-ignore-value
PASS: test-inet_ntop
PASS: test-inet_pton
Starting test_lock ... OK
Starting test_rwlock ... OK
Starting test_recursive_lock ... OK
Starting test_once ... OK
PASS: test-lock
PASS: test-lseek.sh
PASS: test-lstat
PASS: test-malloca
PASS: test-memchr
PASS: test-netdb
PASS: test-netinet_in
test-open.h:60: assertion failed
/bin/bash: line 5:  9235 Aborted                 EXEEXT='' srcdir='.' abs_aux_dir='/root/libvirt/libvirt-0.8.8/build-aux' MAKE='/usr/bin/make' ${dir}$tst
FAIL: test-open
PASS: test-perror.sh
PASS: test-pipe
PASS: test-poll-h
Unconnected socket test... passed
Connected sockets test... passed
General socket test with fork... passed
Pipe test... passed
PASS: test-poll
PASS: test-random_r
PASS: test-rawmemchr
PASS: test-readlink
PASS: test-realloc-gnu
PASS: test-sched
Unconnected socket test... passed
Connected sockets test... passed
General socket test with fork... passed
Pipe test... passed
PASS: test-select
PASS: test-select-in.sh
PASS: test-select-out.sh
PASS: test-sigaction
PASS: test-signal
PASS: test-sigpipe.sh
PASS: test-sleep
PASS: test-snprintf
PASS: test-sockets
PASS: test-stat
PASS: test-stat-time
PASS: test-stdbool
PASS: test-stddef
PASS: test-stdint
PASS: test-stdio
PASS: test-stdlib
PASS: test-strchrnul
PASS: test-strerror
PASS: test-strerror_r
PASS: test-string
PASS: test-strings
PASS: test-strnlen
PASS: test-symlink
PASS: test-sys_ioctl
PASS: test-sys_select
PASS: test-sys_socket
PASS: test-sys_stat
PASS: test-sys_time
PASS: test-sys_utsname
PASS: test-sys_wait
PASS: test-termios
PASS: test-time
PASS: test-uname
PASS: test-unistd
PASS: test-unsetenv
PASS: test-usleep
PASS: test-vasnprintf
PASS: test-vasprintf
test-vc-list-files-git.sh: skipped test: git not found in PATH
SKIP: test-vc-list-files-git.sh
test-vc-list-files-cvs.sh: skipped test: cvs not found in PATH
SKIP: test-vc-list-files-cvs.sh
PASS: test-verify
PASS: test-verify.sh
PASS: test-wchar
PASS: test-xalloc-die.sh
=======================================
1 of 85 tests failed
(2 tests were not run)
Please report to libvir-list redhat com
=======================================
make[5]: *** [check-TESTS] Error 1
make[5]: Leaving directory `/root/libvirt/libvirt-0.8.8/gnulib/tests'
make[4]: *** [check-am] Error 2
make[4]: Leaving directory `/root/libvirt/libvirt-0.8.8/gnulib/tests'
make[3]: *** [check-recursive] Error 1
make[3]: Leaving directory `/root/libvirt/libvirt-0.8.8/gnulib/tests'
make[2]: *** [check] Error 2
make[2]: Leaving directory `/root/libvirt/libvirt-0.8.8/gnulib/tests'
make[1]: *** [check-recursive] Error 1
make[1]: Leaving directory `/root/libvirt/libvirt-0.8.8'
make: *** [debian/stamp-makefile-check] Error 2
dpkg-buildpackage: error: debian/rules build gave error exit status 2
root ubuntu:~/libvirt/libvirt-0.8.8# /bin/bash: line 5:  9235 Aborted                 EXEEXT='' srcdir='.' abs_aux_dir='/root/libvirt/libvirt-0.8.8/build-aux' MAKE='/usr/bin/make' ${dir}$tst
-bash: /bin/bash:: No such file or directory
root ubuntu:~/libvirt/libvirt-0.8.8# test-open.h:60: assertion failed
test-open.h:60:: command not found
root ubuntu:~/libvirt/libvirt-0.8.8#


-- Tavs bezmaksas pasts Inbox.lv

[Date Prev][Date Next]   [Thread Prev][Thread Next]   [Thread Index] [Date Index] [Author Index]