[Date Prev][Date Next]   [Thread Prev][Thread Next]   [Thread Index] [Date Index] [Author Index]

[libvirt] libvirt build errors



Hi,

 

While doing make, I got below errors.  Got same build errors for libvirt-0.9.8 and libvirt-0.9.9. Appreciate your help on this.

 

  CC     libvirt_driver_nwfilter_la-nwfilter_driver.lo

  CC     libvirt_driver_nwfilter_la-nwfilter_gentech_driver.lo

  CC     libvirt_driver_nwfilter_la-nwfilter_ebiptables_driver.lo

  CC     libvirt_driver_nwfilter_la-nwfilter_learnipaddr.lo

In file included from /usr/cisco/packages/libpcap/libpcap-1.0.0/include/pcap.h:45,

                 from nwfilter/nwfilter_learnipaddr.c:29:

/usr/cisco/packages/libpcap/libpcap-1.0.0/include/pcap/pcap.h:339: warning: redundant redeclaration of 'bpf_filter' [-Wredundant-decls]

/usr/cisco/packages/libpcap/libpcap-1.0.0/include/pcap/bpf.h:919: warning: previous declaration of 'bpf_filter' was here

/usr/cisco/packages/libpcap/libpcap-1.0.0/include/pcap/pcap.h:340: warning: redundant redeclaration of 'bpf_validate' [-Wredundant-decls]

/usr/cisco/packages/libpcap/libpcap-1.0.0/include/pcap/bpf.h:918: warning: previous declaration of 'bpf_validate' was here

  CCLD   libvirt_driver_nwfilter.la

libtool: link: require no space between `-L' and `/usr/cisco/packages/libpcap/libpcap-1.0.0/lib'

make[3]: *** [libvirt_driver_nwfilter.la] Error 1

make[3]: Leaving directory `/nobackup/vsm/libvirt-0.9.8/src'

make[2]: *** [all] Error 2

make[2]: Leaving directory `/nobackup/vsm/libvirt-0.9.8/src'

make[1]: *** [all-recursive] Error 1

make[1]: Leaving directory `/nobackup/vsm/libvirt-0.9.8'

make: *** [all] Error 2

[root blr-vxr-009 libvirt-0.9.8]#

 

Thanks,

Chandrashekhar


[Date Prev][Date Next]   [Thread Prev][Thread Next]   [Thread Index] [Date Index] [Author Index]