[Date Prev][Date Next]   [Thread Prev][Thread Next]   [Thread Index] [Date Index] [Author Index]

Re: [libvirt] Entering freeze for libvirt-1.0.5




On Fri, Apr 26, 2013 at 10:09 AM, Daniel Veillard <veillard redhat com> wrote:
This passed my own small usage tests, but please give it a try.
As usual some feedback on portability issues are really welcome too :-)

It compiles on OSX 10.8

make check:

1 of 202 tests failed
(10 tests were not run)
Please report to libvir-list redhat com
=======================================
make[4]: *** [check-TESTS] Error 1
make[3]: *** [check-am] Error 2
make[2]: *** [check-recursive] Error 1
make[1]: *** [check] Error 2
make: *** [check-recursive] Error 1

This is a gnulib test:
[ruben odin ~/src/libvirt-1.0.5/gnulib/tests]$ ./test-getgroupsĀ 
test-getgroups.c:58: assertion failed
Abort trap: 6

Kind regards,

Ruben

[Date Prev][Date Next]   [Thread Prev][Thread Next]   [Thread Index] [Date Index] [Author Index]