[Date Prev][Date Next]   [Thread Prev][Thread Next]   [Thread Index] [Date Index] [Author Index]

[libvirt] Build failed in Jenkins: libvirt-check #1003



Hi,
I don't have time to look into these test failurs in detail atm:

but it seems that one of these commits broke qemuxml2argvtest:

    qemu: New cap flags for scsi-generic
    utils: util functions for scsi hostdev
    qemu: Build qemu command line for scsi host device
    rng: Interleave hostdev elements

for more detail see below.
Cheers,
 -- Guido

 See <http://honk.sigxcpu.org:8001/job/libvirt-check/997/>
 
 ------------------------------------------
 [...truncated 798 lines...]
       ..                                       2   OK
 PASS: viratomictest
 TEST: utiltest
       ...                                      3   OK
 PASS: utiltest
 TEST: shunloadtest
       .                                        1   OK
 PASS: shunloadtest
 TEST: virtimetest
       ...............                          15  OK
 PASS: virtimetest
 TEST: viruritest
       ..................                       18  OK
 PASS: viruritest
 TEST: virkeyfiletest
       .                                        1   OK
 PASS: virkeyfiletest
 TEST: virauthconfigtest
       ......                                   6   OK
 PASS: virauthconfigtest
 TEST: virbitmaptest
       ........                                 8   OK
 PASS: virbitmaptest
 TEST: vircgrouptest
       ........                                 8   OK
 PASS: vircgrouptest
 TEST: virendiantest
       ..                                       2   OK
 PASS: virendiantest
 TEST: viridentitytest
       ..                                       2   OK
 PASS: viridentitytest
 TEST: virkeycodetest
       ..                                       2   OK
 PASS: virkeycodetest
 TEST: virlockspacetest
       .......                                  7   OK
 PASS: virlockspacetest
 TEST: virstringtest
       ..............                           14  OK
 PASS: virstringtest
 TEST: virportallocatortest
       ..                                       2   OK
 PASS: virportallocatortest
 TEST: sysinfotest
       .                                        1   OK
 PASS: sysinfotest
 TEST: virstoragetest
       ........................................ 40 
       .............                            53  OK
 PASS: virstoragetest
 TEST: fdstreamtest
       ....                                     4   OK
 PASS: fdstreamtest
 TEST: fchosttest
       .....                                    5   OK
 PASS: fchosttest
 TEST: virnettlscontexttest
       ........................................ 40 
       ........                                 48  OK
 PASS: virnettlscontexttest
 TEST: securityselinuxtest
 SKIP: securityselinuxtest
 TEST: securityselinuxlabeltest
 SKIP: securityselinuxlabeltest
 TEST: virdrivermoduletest
       ..........                               10  OK
 PASS: virdrivermoduletest
 TEST: xml2sexprtest
       ........................................ 40 
       .............                            53  OK
 PASS: xml2sexprtest
 TEST: sexpr2xmltest
       ........................................ 40 
       ...........                              51  OK
 PASS: sexpr2xmltest
 TEST: xmconfigtest
       ........................................ 40 
       ..........................               66  OK
 PASS: xmconfigtest
 TEST: xencapstest
       ..........                               10  OK
 PASS: xencapstest
 TEST: statstest
 SKIP: statstest
 TEST: reconnect
 SKIP: reconnect
 TEST: qemuxml2argvtest
       ........................................ 40 
       ........................................ 80 
       ........................................ 120
       ........................................ 160
       ........................................ 200
       ........................................ 240
       ........................................ 280
       .........!!!!                            293 FAIL
 FAIL: qemuxml2argvtest
 TEST: qemuxml2xmltest
       ........................................ 40 
       ........................................ 80 
       ........................................ 120
       ...................                      139 OK
 PASS: qemuxml2xmltest
 TEST: qemuxmlnstest
       .......                                  7   OK
 PASS: qemuxmlnstest
 TEST: qemuargv2xmltest
       ........................................ 40 
       ........................................ 80 
       ...                                      83  OK
 PASS: qemuargv2xmltest
 TEST: qemuhelptest
       .................                        17  OK
 PASS: qemuhelptest
 TEST: domainsnapshotxml2xmltest
       ........                                 8   OK
 PASS: domainsnapshotxml2xmltest
 TEST: qemumonitortest
       ..                                       2   OK
 PASS: qemumonitortest
 TEST: qemumonitorjsontest
       ......                                   6   OK
 PASS: qemumonitorjsontest
 TEST: lxcxml2xmltest
       ...                                      3   OK
 PASS: lxcxml2xmltest
 TEST: openvzutilstest
       ..                                       2   OK
 PASS: openvzutilstest
 TEST: vmx2xmltest
       ........................................ 40 
       ..........                               50  OK
 PASS: vmx2xmltest
 TEST: xml2vmxtest
       ........................................ 40 
       .....                                    45  OK
 PASS: xml2vmxtest
 TEST: jsontest
       ....                                     4   OK
 PASS: jsontest
 TEST: networkxml2xmltest
       ..................                       18  OK
 PASS: networkxml2xmltest
 TEST: networkxml2conftest
       ............                             12  OK
 PASS: networkxml2conftest
 TEST: nwfilterxml2xmltest
       ........................................ 40 
       .                                        41  OK
 PASS: nwfilterxml2xmltest
 TEST: storagevolxml2argvtest
       ...........                              11  OK
 PASS: storagevolxml2argvtest
 TEST: storagevolxml2xmltest
       .......                                  7   OK
 PASS: storagevolxml2xmltest
 TEST: storagepoolxml2xmltest
       ...............                          15  OK
 PASS: storagepoolxml2xmltest
 TEST: nodedevxml2xmltest
       .............                            13  OK
 PASS: nodedevxml2xmltest
 TEST: interfacexml2xmltest
       ...................                      19  OK
 PASS: interfacexml2xmltest
 TEST: cputest
       ........................................ 40 
       ..........................               66  OK
 PASS: cputest
 TEST: eventtest
       ...............                          15  OK
 PASS: eventtest
 TEST: libvirtdconftest
       .......................................  39  OK
 PASS: libvirtdconftest
 TEST: capabilityschematest
       ..............                           14  OK
 PASS: capabilityschematest
 TEST: interfaceschematest
       ..................                       18  OK
 PASS: interfaceschematest
 TEST: networkschematest
       ........................................ 40 
       .                                        41  OK
 PASS: networkschematest
 TEST: storagepoolschematest
       ................................         32  OK
 PASS: storagepoolschematest
 TEST: storagevolschematest
       ..............                           14  OK
 PASS: storagevolschematest
 TEST: domainschematest
       ........................................ 40 
       ........................................ 80 
       ........................................ 120
       ........................................ 160
       ........................................ 200
       ........................................ 240
       ........................................ 280
       ........................................ 320
       ........................................ 360
       ........................................ 400
       ........................................ 440
       ..............................           470 OK
 PASS: domainschematest
 TEST: nodedevschematest
       ...............                          15  OK
 PASS: nodedevschematest
 TEST: nwfilterschematest
       ........................................ 40 
       .                                        41  OK
 PASS: nwfilterschematest
 TEST: domainsnapshotschematest
       ...............                          15  OK
 PASS: domainsnapshotschematest
 TEST: test_conf.sh
       ..                                       2   OK
 PASS: test_conf.sh
 PASS: cpuset
 PASS: define-dev-segfault
 PASS: int-overflow
 PASS: libvirtd-fail
 PASS: libvirtd-pool
 PASS: read-bufsiz
 PASS: read-non-seekable
 PASS: start
 PASS: vcpupin
 TEST: virsh-all
       ........................................ 40 
       ........................................ 80 
       ........................................ 120
       ........................................ 160
       ......................................   198 OK
 PASS: virsh-all
 PASS: virsh-optparse
 PASS: virsh-schedinfo
 PASS: virsh-synopsis
 PASS: virsh-undefine
 =======================================
 1 of 82 tests failed
 (4 tests were not run)
 Please report to libvir-list redhat com
 =======================================
 make[2]: *** [check-TESTS] Error 1
 make[2]: Leaving directory `<http://honk.sigxcpu.org:8001/job/libvirt-check/ws/tests'>
 make[1]: *** [check-am] Error 2
 make[1]: Leaving directory `<http://honk.sigxcpu.org:8001/job/libvirt-check/ws/tests'>
 make: *** [check-recursive] Error 1
 Build step 'Execute shell' marked build as failure
 


[Date Prev][Date Next]   [Thread Prev][Thread Next]   [Thread Index] [Date Index] [Author Index]