[Date Prev][Date Next]   [Thread Prev][Thread Next]   [Thread Index] [Date Index] [Author Index]

[libvirt] rpmbuild libvirt 1.1.2 problem



hi:
    i build rpm in centos 6.2,   libvirt version 1.1.2,i found an error  FAIL: virsh-uriprecedence
 
    Details in the attachment,thanks !    Wait for a response


---------------------------------------
21CN手机邮Android客户端,邮件随身享!
PASS: virshtest
PASS: sockettest
PASS: nodeinfotest
PASS: virbuftest
PASS: commandtest
PASS: seclabeltest
PASS: virhashtest
PASS: virnetmessagetest
PASS: virnetsockettest
PASS: viratomictest
PASS: utiltest
PASS: shunloadtest
PASS: virtimetest
PASS: viruritest
PASS: virkeyfiletest
PASS: virauthconfigtest
PASS: virbitmaptest
PASS: vircgrouptest
PASS: virendiantest
PASS: viridentitytest
PASS: virkeycodetest
PASS: virlockspacetest
PASS: virstringtest
PASS: virportallocatortest
PASS: sysinfotest
PASS: virstoragetest
PASS: fdstreamtest
PASS: fchosttest
PASS: virdbustest
PASS: virsystemdtest
PASS: virnettlscontexttest
PASS: virnettlssessiontest
SKIP: securityselinuxtest
SKIP: securityselinuxlabeltest
PASS: virdrivermoduletest
PASS: xml2sexprtest
PASS: sexpr2xmltest
PASS: xmconfigtest
PASS: xencapstest
SKIP: statstest
SKIP: reconnect
PASS: qemuxml2argvtest
PASS: qemuxml2xmltest
PASS: qemuxmlnstest
PASS: qemuargv2xmltest
PASS: qemuhelptest
PASS: domainsnapshotxml2xmltest
PASS: qemumonitortest
SKIP: qemumonitorjsontest
SKIP: qemuhotplugtest
SKIP: qemuagenttest
PASS: lxcxml2xmltest
PASS: esxutilstest
PASS: vmx2xmltest
PASS: xml2vmxtest
PASS: networkxml2xmltest
PASS: networkxml2xmlupdatetest
PASS: networkxml2conftest
PASS: nwfilterxml2xmltest
PASS: storagevolxml2argvtest
PASS: storagevolxml2xmltest
PASS: storagepoolxml2xmltest
PASS: nodedevxml2xmltest
PASS: interfacexml2xmltest
PASS: cputest
PASS: eventtest
PASS: libvirtdconftest
PASS: capabilityschematest
PASS: interfaceschematest
PASS: networkschematest
PASS: storagepoolschematest
PASS: storagevolschematest
PASS: domainschematest
PASS: nodedevschematest
PASS: nwfilterschematest
PASS: domainsnapshotschematest
PASS: test_conf.sh
PASS: cpuset
PASS: define-dev-segfault
PASS: int-overflow
PASS: libvirtd-fail
PASS: libvirtd-pool
PASS: read-bufsiz
PASS: read-non-seekable
PASS: start
FAIL: virsh-uriprecedence
PASS: vcpupin
PASS: virsh-all
PASS: virsh-optparse
PASS: virsh-schedinfo
PASS: virsh-synopsis
PASS: virsh-undefine
make[3]: Entering directory `/root/rpmbuild/BUILD/libvirt-1.1.2/tests'
make[3]: Nothing to be done for `all'.
make[3]: Leaving directory `/root/rpmbuild/BUILD/libvirt-1.1.2/tests'
============================================================================
Testsuite summary for libvirt 1.1.2
============================================================================
# TOTAL: 92
# PASS:  84
# SKIP:  7
# XFAIL: 0
# FAIL:  1
# XPASS: 0
# ERROR: 0
============================================================================
See tests/test-suite.log
Please report to libvir-list redhat com
============================================================================
make[2]: *** [test-suite.log] Error 1
make[2]: Leaving directory `/root/rpmbuild/BUILD/libvirt-1.1.2/tests'
make[1]: *** [check-TESTS] Error 2
make[1]: Leaving directory `/root/rpmbuild/BUILD/libvirt-1.1.2/tests'
make: *** [check-am] Error 2
+ cat test-suite.log
=========================================
   libvirt 1.1.2: tests/test-suite.log
=========================================
 
# TOTAL: 92
# PASS:  84
# SKIP:  7
# XFAIL: 0
# FAIL:  1
# XPASS: 0
# ERROR: 0
 
. contents:: :depth: 2
 
SKIP: securityselinuxtest
=========================
 
TEST: securityselinuxtest
 
SKIP: securityselinuxlabeltest
==============================
 
TEST: securityselinuxlabeltest
 
SKIP: statstest
===============
 
TEST: statstest
 
SKIP: reconnect
===============
 
TEST: reconnect
 
SKIP: qemumonitorjsontest
=========================
 
TEST: qemumonitorjsontest
libvirt not compiled with yajl, skipping this test
 
SKIP: qemuhotplugtest
=====================
 
TEST: qemuhotplugtest
libvirt not compiled with yajl, skipping this test
 
SKIP: qemuagenttest
===================
 
TEST: qemuagenttest
libvirt not compiled with yajl, skipping this test
 
FAIL: virsh-uriprecedence
=========================
 
  1) User config file                                             ... FAILED
  2) LIBVIRT_DEFAULT_URI                                          ... OK
  3) VIRSH_DEFAULT_CONNECT_URI                                    ... OK
  4) Parameter                                                    ... OK
 
+ exit 1
error: Bad exit status from /var/tmp/rpm-tmp.ofhNGm (%check)
 
 
RPM build errors:
    Bad exit status from /var/tmp/rpm-tmp.ofhNGm (%check)

[Date Prev][Date Next]   [Thread Prev][Thread Next]   [Thread Index] [Date Index] [Author Index]