[Date Prev][Date Next]   [Thread Prev][Thread Next]   [Thread Index] [Date Index] [Author Index]

Re: Linux-audit Digest, Vol 39, Issue 16



On Wednesday 19 December 2007 11:40:59 pm Marius.bao wrote:
> I downloaded the source package yesterday, but the make processing went
> wrong, the error message is as follows:
> Makefile:43: /usr/share/selinux/devel/Makefile: No such file or directory
> make[3]: *** No rule to make target `/usr/share/selinux/devel/Makefile'.
> Stop.
> make[3]: Leaving directory
> `/home/paul/Develop/audit/audit-test/trustedprograms/tests/policy'
> make[2]: *** [subdirs] Error 2
> make[2]: Leaving directory
> `/home/paul/Develop/audit/audit-test/trustedprograms/tests'
> make[1]: *** [subdirs] Error 2
> make[1]: Leaving directory
> `/home/paul/Develop/audit/audit-test/trustedprograms'
> make: *** [subdirs] Error 2
>
> I'm running Fedora Core 7

It looks like you need to install the SELinux policy development RPM, I 
believe the package name is "selinux-policy-devel".

-- 
paul moore
linux security @ hp


[Date Prev][Date Next]   [Thread Prev][Thread Next]   [Thread Index] [Date Index] [Author Index]