[Date Prev][Date Next]   [Thread Prev][Thread Next]   [Thread Index] [Date Index] [Author Index]

RE: [Linux-cluster] Cluster-1.03.00 tarball doesn't compile



I pulled a source tree out of the RHEL4 branch. This time the
compilation went a bit further but still failed. The outputs are
attached. Any ideas?

lin

 make[5]: Entering directory `/usr/src/cluster/fence/agents/xvm'
gcc -Wall -I../../include -I../../config  -I../../../ccs/lib
-DFENCE_RELEASE_NAME=\"DEVEL.1166035451\" -Wall -Werror
-Wstrict-prototypes -Wshadow -ggdb -D_GNU_SOURCE -c -o fence_xvm.o
fence_xvm.c 
In file included from fence_xvm.c:50:
xvm.h:23:21: sechash.h: No such file or directory
In file included from fence_xvm.c:50:
xvm.h:72: error: `SHA512_LENGTH' undeclared here (not in a function)
fence_xvm.c: In function `main':
fence_xvm.c:359: warning: implicit declaration of function
`NSS_NoDB_Init'
fence_xvm.c:359: error: `SECSuccess' undeclared (first use in this
function)
fence_xvm.c:359: error: (Each undeclared identifier is reported only
once
fence_xvm.c:359: error: for each function it appears in.)
make[5]: *** [fence_xvm.o] Error 1
make[5]: Leaving directory `/usr/src/cluster/fence/agents/xvm'

> -----Original Message-----
> From: linux-cluster-bounces redhat com 
> [mailto:linux-cluster-bounces redhat com] On Behalf Of Lon Hohberger
> Sent: Wednesday, December 13, 2006 8:01 AM
> To: linux clustering
> Subject: Re: [Linux-cluster] Cluster-1.03.00 tarball doesn't compile
> 
> On Tue, 2006-12-12 at 14:22 -0800, Lin Shen (lshen) wrote:
> > I downloaded cluster-1.03.00 tarball and tried to build it against 
> > kernel 2.6.9-42.7.Elsmp, but got a bunch of compiling errors. Has 
> > anyone seen this before?
> > 
> 
> The cluster-x.yy.zz tarballs do not build against the RHEL 
> kernels; check out the RHEL4 branch of CVS for that.
> 
> -- Lon
> 
> 


[Date Prev][Date Next]   [Thread Prev][Thread Next]   [Thread Index] [Date Index] [Author Index]