[Date Prev][Date Next]   [Thread Prev][Thread Next]   [Thread Index] [Date Index] [Author Index]

[Linux-cluster] cvs STABLE build failed



Здравствуйте, .


Is there something wrong on my side?


/home/Compile/GFS/STABLE/cluster/gnbd-kernel/src/gnbd.c:1051: error: syntax error before string constant

/home/Compile/GFS/STABLE/cluster/gnbd-kernel/src/gnbd.c:1051: warning: type defaults to ‘int’ in declaration of ‘MODULE_PARM’

/home/Compile/GFS/STABLE/cluster/gnbd-kernel/src/gnbd.c:1051: warning: function declaration isn’t a prototype

/home/Compile/GFS/STABLE/cluster/gnbd-kernel/src/gnbd.c:1051: warning: data definition has no type or storage class

make[4]: *** [/home/Compile/GFS/STABLE/cluster/gnbd-kernel/src/gnbd.o] Error 1

make[3]: *** [_module_/home/Compile/GFS/STABLE/cluster/gnbd-kernel/src] Error 2

make[3]: Leaving directory `/usr/src/linux-2.6.17.4'

make[2]: *** [all] Error 2

make[2]: Leaving directory `/home/Compile/GFS/STABLE/cluster/gnbd-kernel/src'

make[1]: *** [install] Error 2

make[1]: Leaving directory `/home/Compile/GFS/STABLE/cluster/gnbd-kernel'

make: *** [all] Error 2



-- 

С уважением,

 Flagman                          mailto:Flagman incomtel ru


[Date Prev][Date Next]   [Thread Prev][Thread Next]   [Thread Index] [Date Index] [Author Index]