[Date Prev][Date Next]   [Thread Prev][Thread Next]   [Thread Index] [Date Index] [Author Index]

Re[2]: [Linux-cluster] cvs STABLE build failed



Здравствуйте, Benjamin.


another one kludge...


make[3]: Entering directory `/home/Compile/GFS/STABLE/cluster/rgmanager/src/utils'

make[3]: *** No rule to make target `clunfslock.sh', needed by `clunfslock'.  Stop.

make[3]: Leaving directory `/home/Compile/GFS/STABLE/cluster/rgmanager/src/utils'

make[2]: *** [install] Error 2

make[2]: Leaving directory `/home/Compile/GFS/STABLE/cluster/rgmanager/src'

make[1]: *** [install] Error 2

make[1]: Leaving directory `/home/Compile/GFS/STABLE/cluster/rgmanager'

make: *** [all] Error 2



-- 

С уважением,

 Flagman incomtel ru                        

 mailto:Flagman incomtel ru


Вы писали 12 июля 2006 г., 21:35:51:


> On Wed, Jul 12, 2006 at 11:38:12AM +0400, Flagman incomtel ru wrote:

>>    Здравствуйте, .

>> 

>>    Is there something wrong on my side?


> Nope. It was an oversight on my part. A fix has veen checked into CVS.


> -Ben

>  

>>    /home/Compile/GFS/STABLE/cluster/gnbd-kernel/src/gnbd.c:1051: error:

>>    syntax error before string constant

>> 

>>    /home/Compile/GFS/STABLE/cluster/gnbd-kernel/src/gnbd.c:1051: warning:

>>    type defaults to ‘int’ in declaration of ‘MODULE_PARM’

>> 

>>    /home/Compile/GFS/STABLE/cluster/gnbd-kernel/src/gnbd.c:1051: warning:

>>    function declaration isn’t a prototype

>> 

>>    /home/Compile/GFS/STABLE/cluster/gnbd-kernel/src/gnbd.c:1051: warning:

>>    data definition has no type or storage class

>> 

>>    make[4]: *** [/home/Compile/GFS/STABLE/cluster/gnbd-kernel/src/gnbd.o]

>>    Error 1

>> 

>>    make[3]: *** [_module_/home/Compile/GFS/STABLE/cluster/gnbd-kernel/src]

>>    Error 2

>> 

>>    make[3]: Leaving directory `/usr/src/linux-2.6.17.4'

>> 

>>    make[2]: *** [all] Error 2

>> 

>>    make[2]: Leaving directory

>>    `/home/Compile/GFS/STABLE/cluster/gnbd-kernel/src'

>> 

>>    make[1]: *** [install] Error 2

>> 

>>    make[1]: Leaving directory `/home/Compile/GFS/STABLE/cluster/gnbd-kernel'

>> 

>>    make: *** [all] Error 2

>> 

>>    --

>> 

>>    С уважением,

>> 

>>     Flagman                          [1]mailto:Flagman incomtel ru

>> 

>> References

>> 

>>    Visible links

>>    1. mailto:Flagman incomtel ru


>> --

>> Linux-cluster mailing list

>> Linux-cluster redhat com

>> https://www.redhat.com/mailman/listinfo/linux-cluster


> --

> Linux-cluster mailing list

Linux-cluster redhat com

https://www.redhat.com/mailman/listinfo/linux-cluster

> THX!!


[Date Prev][Date Next]   [Thread Prev][Thread Next]   [Thread Index] [Date Index] [Author Index]