[Date Prev][Date Next]   [Thread Prev][Thread Next]   [Thread Index] [Date Index] [Author Index]

[Linux-cluster] CMan Build Issue



Trying to build cman from cluster relase 1.03.00.  Also has same error with 1.04.00.  Building against Xen-3.0.5 patched 2.6.18.  I get this:

  CC [M]  /var/tmp/portage/sys-cluster/cman-kernel-1.03.00/work/cluster-1.03.00/cman-kernel/src/proc.o
/var/tmp/portage/sys-cluster/cman-kernel-1.03.00/work/cluster-1.03.00/cman-kernel/src/cnxman.c: In function 'do_ioctl_join_cluster':
/var/tmp/portage/sys-cluster/cman-kernel-1.03.00/work/cluster-1.03.00/cman-kernel/src/cnxman.c:1751: warning: implicit declaration of function 'init_utsname'
/var/tmp/portage/sys-cluster/cman-kernel-1.03.00/work/cluster-1.03.00/cman-kernel/src/cnxman.c:1751: error: invalid type argument of '->'
make[3]: *** [/var/tmp/portage/sys-cluster/cman-kernel-1.03.00/work/cluster-1.03.00/cman-kernel/src/cnxman.o] Error 1
make[3]: *** Waiting for unfinished jobs....
make[2]: *** [_module_/var/tmp/portage/sys-cluster/cman-kernel-1.03.00/work/cluster-1.03.00/cman-kernel/src] Error 2
make[2]: Leaving directory `/usr/src/linux-2.6.18-xenU'
make[1]: *** [all] Error 2
make[1]: Leaving directory `/var/tmp/portage/sys-cluster/cman-kernel-1.03.00/work/cluster-1.03.00/cman-kernel/src'
make: *** [all] Error 2

Any ideas?

-- 
Jayson Vantuyl
Systems Architect



[Date Prev][Date Next]   [Thread Prev][Thread Next]   [Thread Index] [Date Index] [Author Index]