[Date Prev][Date Next]   [Thread Prev][Thread Next]   [Thread Index] [Date Index] [Author Index]

[Linux-cluster] gfs-kernel with 2.6.22




Is there someone who is using 2.6.22 with gfs-kernel? (1.03 or 1.04)
All of this was working fine with 2.6.20 ...

I am using gentoo-2.6.22-r5 and was just wondering if I need to bug hunt or not. Thanks.

Error message below...


make[3]: Entering directory `/usr/src/linux-2.6.22-gentoo-r5'
  CC [M]  /var/tmp/portage/sys-cluster/gfs-kernel-1.03.00-r1/work/cluster-1.03.00/gfs-kernel/src/nolock/main.o
/var/tmp/portage/sys-cluster/gfs-kernel-1.03.00-r1/work/cluster-1.03.00/gfs-kernel/src/nolock/main.c: In function 'nolock_plock_get':
/var/tmp/portage/sys-cluster/gfs-kernel-1.03.00-r1/work/cluster-1.03.00/gfs-kernel/src/nolock/main.c:250: error: too many arguments to function 'posix_test_lock'
make[4]: *** [/var/tmp/portage/sys-cluster/gfs-kernel-1.03.00-r1/work/cluster-1.03.00/gfs-kernel/src/nolock/main.o] Error 1
make[3]: *** [_module_/var/tmp/portage/sys-cluster/gfs-kernel-1.03.00-r1/work/cluster-1.03.00/gfs-kernel/src/nolock] Error 2
make[3]: Leaving directory `/usr/src/linux-2.6.22-gentoo-r5'
make[2]: *** [all] Error 2
make[2]: Leaving directory `/var/tmp/portage/sys-cluster/gfs-kernel-1.03.00-r1/work/cluster-1.03.00/gfs-kernel/src/nolock'
make[1]: *** [all] Error 2
make[1]: Leaving directory `/var/tmp/portage/sys-cluster/gfs-kernel-1.03.00-r1/work/cluster-1.03.00/gfs-kernel/src'
make: *** [all] Error 2

!!! ERROR: sys-cluster/gfs-kernel-1.03.00-r1 failed.
Call stack:
  ebuild.sh, line 1638:   Called dyn_compile
  ebuild.sh, line 985:   Called qa_call 'src_compile'
  ebuild.sh, line 44:   Called src_compile
  gfs-kernel-1.03.00-r1.ebuild, line 59:   Called die


Alexandre Racine
Projets spéciaux
514-461-1300 poste 3304
alexandre racine mhicc org


<<winmail.dat>>


[Date Prev][Date Next]   [Thread Prev][Thread Next]   [Thread Index] [Date Index] [Author Index]