[Date Prev][Date Next]   [Thread Prev][Thread Next]   [Thread Index] [Date Index] [Author Index]

Re: [linux-lvm] Problem compiling LVM on 2.2.19



Hi again:

Jesus Manuel NAVARRO LOPEZ wrote:
> 
> Hi, list:
> 

[...]

> Then, when `make modules`, the compilation stops.  This seems to be the
> relevant part:
> 
> lvm.c: In function `lvm_do_lv_create':
> lvm.c:2192: structure has no member named `de'
> lvm.c: In function `lvm_do_lv_remove':
> lvm.c:2277: structure has no member named `de'
> lvm.c: At top level:
> lvm.c:326: warning: `__update_hardsectsize' declared `static' but never
> defined
> lvm.c:1891: warning: `__update_hardblocksize' defined but not used
> make[2]: *** [lvm.o] Error 1
> make[2]: Leaving directory `/usr/src/linux-2.2.19/drivers/block'
> make[1]: *** [_modsubdir_block] Error 2
> make[1]: Leaving directory `/usr/src/linux-2.2.19/drivers'
> make: *** [_mod_drivers] Error 2
> 

...Still exactly same problem with lvm-1.0.1-rc4
-- 
SALUD,
Jesús
***
jesus_navarro promofinarsa es
***



[Date Prev][Date Next]   [Thread Prev][Thread Next]   [Thread Index] [Date Index] [Author Index]