[Date Prev][Date Next]   [Thread Prev][Thread Next]   [Thread Index] [Date Index] [Author Index]

[Open-scap] make check error 0.9.7



Keeps failing when I run a make check here and havent figured out what I am missing.  Any ideas?

1 of 1 test failed

Please report to open-scap-list redhat com

==========================================

make[4]: *** [check-TESTS] Error 1

make[4]: Leaving directory `/opt/xtra/openscap-0.9.7/tests/probes/password'

make[3]: *** [check-am] Error 2

make[3]: Leaving directory `/opt/xtra/openscap-0.9.7/tests/probes/password'

make[2]: *** [check-recursive] Error 1

make[2]: Leaving directory `/opt/xtra/openscap-0.9.7/tests/probes'

make[1]: *** [check-recursive] Error 1

make[1]: Leaving directory `/opt/xtra/openscap-0.9.7/tests'

make: *** [check-recursive] Error 1


Aaron Lamb


[Date Prev][Date Next]   [Thread Prev][Thread Next]   [Thread Index] [Date Index] [Author Index]