[Date Prev][Date Next]   [Thread Prev][Thread Next]   [Thread Index] [Date Index] [Author Index]

[Rdo-list] RDO Bug Statistics [2016-04-20]



# RDO Bugs on 2016-04-20

This email summarizes the active RDO bugs listed in the Red Hat Bugzilla
database at <https://bugzilla.redhat.com/>.

To report a new bug against RDO, go to:

  <https://bugzilla.redhat.com/enter_bug.cgi?product=RDO>

## Summary

- Open (NEW, ASSIGNED, ON_DEV): 440
- Fixed (MODIFIED, POST, ON_QA): 60


## Number of open bugs by component

                    dib-utils [  1]
            diskimage-builder [  3] +
                 distribution [ 17] ++++++
                      dnsmasq [  1]
                Documentation [  4] +
                      instack [  5] ++
           instack-undercloud [ 29] +++++++++++
                      iproute [  1]
         openstack-ceilometer [  3] +
             openstack-cinder [ 13] +++++
    openstack-foreman-inst... [  2]
             openstack-glance [  3] +
               openstack-heat [  5] ++
            openstack-horizon [  3] +
             openstack-ironic [  4] +
    openstack-ironic-disco... [  2]
           openstack-keystone [  9] +++
             openstack-manila [ 12] ++++
            openstack-neutron [ 13] +++++
               openstack-nova [ 25] ++++++++++
          openstack-packstack [100] ++++++++++++++++++++++++++++++++++++++++
     openstack-puppet-modules [ 19] +++++++
             openstack-sahara [  2]
            openstack-selinux [ 12] ++++
              openstack-swift [  4] +
            openstack-tripleo [ 29] +++++++++++
    openstack-tripleo-heat... [  8] +++
    openstack-tripleo-imag... [  3] +
              openstack-trove [  2]
             openstack-tuskar [  2]
              openstack-utils [  1]
                  openvswitch [  1]
               Package Review [ 13] +++++
          python-cinderclient [  1]
          python-glanceclient [  2]
    python-keystonemiddleware [  1]
         python-neutronclient [  4] +
            python-novaclient [  2]
       python-openstackclient [  6] ++
           python-oslo-config [  2]
                  rdo-manager [ 55] ++++++++++++++++++++++
              rdo-manager-cli [  6] ++
              rdo-manager-gui [  4] +
                       rdopkg [  2]
                         RFEs [  2]
                      tempest [  2]

## Open bugs

This is a list of "open" bugs by component.  An "open" bug is in state
NEW, ASSIGNED, ON_DEV and has not yet been fixed.

(440 bugs)


### dib-utils (1 bug)


[1263779 ] http://bugzilla.redhat.com/1263779 (NEW)
           Component: dib-utils
           Last change: 2016-04-18
           Summary: Packstack Ironic admin_url misconfigured in nova.conf

### diskimage-builder (3 bugs)


[1210465 ] http://bugzilla.redhat.com/1210465 (NEW)
           Component: diskimage-builder
           Last change: 2016-04-18
           Summary: instack-build-images fails when building CentOS7 due to
                    EPEL version change

[1265598 ] http://bugzilla.redhat.com/1265598 (NEW)
           Component: diskimage-builder
           Last change: 2016-04-18
           Summary: rdo-manager liberty dib fails on python-pecan version

[1302176 ] http://bugzilla.redhat.com/1302176 (NEW)
           Component: diskimage-builder
           Last change: 2016-04-18
           Summary: add support for deltarpm

### distribution (17 bugs)


[1176509 ] http://bugzilla.redhat.com/1176509 (NEW)
           Component: distribution
           Last change: 2016-04-18
           Summary: [TripleO] text of uninitialized deployment needs
                    rewording

[1219890 ] http://bugzilla.redhat.com/1219890 (ASSIGNED)
           Component: distribution
           Last change: 2016-04-19
           Summary: Unable to launch an instance

[1243533 ] http://bugzilla.redhat.com/1243533 (NEW)
           Component: distribution
           Last change: 2016-04-18
           Summary: (RDO) Tracker: Review requests for new RDO Liberty
                    packages

[1314460 ] http://bugzilla.redhat.com/1314460 (NEW)
           Component: distribution
           Last change: 2016-04-18
           Summary: mistral references an entry point (tempest) what cannot
                    be reached

[1271169 ] http://bugzilla.redhat.com/1271169 (NEW)
           Component: distribution
           Last change: 2016-04-18
           Summary: [doc] virtual environment setup

[1290163 ] http://bugzilla.redhat.com/1290163 (NEW)
           Component: distribution
           Last change: 2016-04-18
           Summary: Tracker: Blockers and Review requests for new RDO
                    Mitaka packages

[1063474 ] http://bugzilla.redhat.com/1063474 (ASSIGNED)
           Component: distribution
           Last change: 2016-04-18
           Summary: python-backports:  /usr/lib/python2.6/site-
                    packages/babel/__init__.py:33: UserWarning: Module
                    backports was already imported from
                    /usr/lib64/python2.6/site-
                    packages/backports/__init__.pyc, but /usr/lib/python2.6
                    /site-packages is being added to sys.path

[1316169 ] http://bugzilla.redhat.com/1316169 (NEW)
           Component: distribution
           Last change: 2016-04-18
           Summary: openstack-barbican-api missing pid dir or wrong pid
                    file specified

[1218555 ] http://bugzilla.redhat.com/1218555 (ASSIGNED)
           Component: distribution
           Last change: 2016-04-18
           Summary: rdo-release needs to enable  RHEL optional extras and
                    rh-common repositories

[1301751 ] http://bugzilla.redhat.com/1301751 (NEW)
           Component: distribution
           Last change: 2016-04-18
           Summary: Move all logging to stdout/err to allow systemd
                    throttling logging of errors

[1206867 ] http://bugzilla.redhat.com/1206867 (NEW)
           Component: distribution
           Last change: 2016-04-18
           Summary: Tracking bug for bugs that Lars is interested in

[1275608 ] http://bugzilla.redhat.com/1275608 (NEW)
           Component: distribution
           Last change: 2016-04-18
           Summary: EOL'ed rpm file URL not up to date

[1261821 ] http://bugzilla.redhat.com/1261821 (NEW)
           Component: distribution
           Last change: 2016-04-18
           Summary: [RFE] Packages upgrade path checks in Delorean CI

[1317971 ] http://bugzilla.redhat.com/1317971 (NEW)
           Component: distribution
           Last change: 2016-04-18
           Summary: openstack-cloudkitty-common should have a
                    /etc/cloudkitty/api_paste.ini

[1315389 ] http://bugzilla.redhat.com/1315389 (NEW)
           Component: distribution
           Last change: 2016-04-18
           Summary: [python-magnum] the default config file is empty and no
                    other sample provided

[1178131 ] http://bugzilla.redhat.com/1178131 (NEW)
           Component: distribution
           Last change: 2016-04-18
           Summary: SSL supports only broken crypto

[1176506 ] http://bugzilla.redhat.com/1176506 (NEW)
           Component: distribution
           Last change: 2016-04-18
           Summary: [TripleO] Provisioning Images filter doesn't work

### dnsmasq (1 bug)


[1164770 ] http://bugzilla.redhat.com/1164770 (NEW)
           Component: dnsmasq
           Last change: 2016-04-18
           Summary: On a 3 node setup (controller, network and compute),
                    instance is not getting dhcp ip (while using flat
                    network)

### Documentation (4 bugs)


[1272111 ] http://bugzilla.redhat.com/1272111 (NEW)
           Component: Documentation
           Last change: 2016-04-18
           Summary: RFE : document how to access  horizon in RDO manager
                    VIRT setup

[1272108 ] http://bugzilla.redhat.com/1272108 (NEW)
           Component: Documentation
           Last change: 2016-04-18
           Summary: [DOC] External network should be documents in RDO
                    manager installation

[1271793 ] http://bugzilla.redhat.com/1271793 (NEW)
           Component: Documentation
           Last change: 2016-04-18
           Summary: rdo-manager doc has incomplete /etc/hosts configuration

[1271888 ] http://bugzilla.redhat.com/1271888 (NEW)
           Component: Documentation
           Last change: 2016-04-18
           Summary: step required to build images for overcloud

### instack (5 bugs)


[1315827 ] http://bugzilla.redhat.com/1315827 (NEW)
           Component: instack
           Last change: 2016-04-18
           Summary: openstack undercloud install fails with "Element pip-
                    and-virtualenv already loaded."

[1224459 ] http://bugzilla.redhat.com/1224459 (NEW)
           Component: instack
           Last change: 2016-04-18
           Summary: AttributeError: 'User' object has no attribute '_meta'

[1192622 ] http://bugzilla.redhat.com/1192622 (NEW)
           Component: instack
           Last change: 2016-04-18
           Summary: RDO Instack FAQ has serious doc bug

[1201372 ] http://bugzilla.redhat.com/1201372 (NEW)
           Component: instack
           Last change: 2016-04-18
           Summary: instack-update-overcloud fails because it tries to
                    access non-existing files

[1225590 ] http://bugzilla.redhat.com/1225590 (NEW)
           Component: instack
           Last change: 2016-04-18
           Summary: When supplying Satellite registration fails do to Curl
                    SSL error but i see now curl code

### instack-undercloud (29 bugs)


[1266451 ] http://bugzilla.redhat.com/1266451 (NEW)
           Component: instack-undercloud
           Last change: 2016-04-18
           Summary: instack-undercloud fails to setup seed vm, parse error
                    while creating ssh key

[1220509 ] http://bugzilla.redhat.com/1220509 (ASSIGNED)
           Component: instack-undercloud
           Last change: 2016-04-18
           Summary: wget is missing from qcow2 image fails instack-build-
                    images script

[1271200 ] http://bugzilla.redhat.com/1271200 (ASSIGNED)
           Component: instack-undercloud
           Last change: 2016-04-18
           Summary: Overcloud images contain Kilo repos

[1216243 ] http://bugzilla.redhat.com/1216243 (ASSIGNED)
           Component: instack-undercloud
           Last change: 2016-02-01
           Summary: Undercloud install leaves services enabled but not
                    started

[1265334 ] http://bugzilla.redhat.com/1265334 (NEW)
           Component: instack-undercloud
           Last change: 2016-04-18
           Summary: rdo-manager liberty instack undercloud puppet apply
                    fails w/ missing package dep pyinotify

[1211800 ] http://bugzilla.redhat.com/1211800 (ASSIGNED)
           Component: instack-undercloud
           Last change: 2016-04-18
           Summary: Sphinx docs for instack-undercloud have an incorrect
                    network topology

[1230870 ] http://bugzilla.redhat.com/1230870 (NEW)
           Component: instack-undercloud
           Last change: 2016-04-18
           Summary: instack-undercloud: The documention is missing the
                    instructions for installing the epel repos prior to
                    running "sudo yum install -y python-rdomanager-
                    oscplugin'.

[1200081 ] http://bugzilla.redhat.com/1200081 (NEW)
           Component: instack-undercloud
           Last change: 2016-04-18
           Summary: Installing instack undercloud on Fedora20 VM fails

[1215178 ] http://bugzilla.redhat.com/1215178 (NEW)
           Component: instack-undercloud
           Last change: 2016-04-18
           Summary: RDO-instack-undercloud: instack-install-undercloud
                    exists with error "ImportError: No module named six."

[1234652 ] http://bugzilla.redhat.com/1234652 (NEW)
           Component: instack-undercloud
           Last change: 2016-04-18
           Summary: Instack has hard coded values for specific config files

[1221812 ] http://bugzilla.redhat.com/1221812 (NEW)
           Component: instack-undercloud
           Last change: 2016-04-18
           Summary: instack-undercloud install fails w/ rdo-kilo on
                    rhel-7.1 due to rpm gpg key import

[1232083 ] http://bugzilla.redhat.com/1232083 (NEW)
           Component: instack-undercloud
           Last change: 2016-04-18
           Summary: instack-ironic-deployment --register-nodes swallows
                    error output

[1270585 ] http://bugzilla.redhat.com/1270585 (NEW)
           Component: instack-undercloud
           Last change: 2016-04-18
           Summary: instack isntallation fails with  parse error: Invalid
                    string liberty on CentOS

[1175687 ] http://bugzilla.redhat.com/1175687 (NEW)
           Component: instack-undercloud
           Last change: 2016-04-18
           Summary: instack is not configued properly to log all
                    Horizon/Tuskar messages in the undercloud deployment

[1225688 ] http://bugzilla.redhat.com/1225688 (ASSIGNED)
           Component: instack-undercloud
           Last change: 2016-04-18
           Summary: instack-undercloud: running instack-build-imsages
                    exists with "Not enough RAM to use tmpfs for build.
                    (4048492 < 4G)"

[1266101 ] http://bugzilla.redhat.com/1266101 (NEW)
           Component: instack-undercloud
           Last change: 2016-04-18
           Summary: instack-virt-setup fails on CentOS7

[1299958 ] http://bugzilla.redhat.com/1299958 (NEW)
           Component: instack-undercloud
           Last change: 2016-04-18
           Summary: instack-virt-setup does not set explicit path, can't
                    find binaries

[1199637 ] http://bugzilla.redhat.com/1199637 (ASSIGNED)
           Component: instack-undercloud
           Last change: 2016-04-18
           Summary: [RDO][Instack-undercloud]: harmless ERROR: installing
                    'template' displays when building the images .

[1283812 ] http://bugzilla.redhat.com/1283812 (NEW)
           Component: instack-undercloud
           Last change: 2016-04-18
           Summary: local_interface=bond0.120 in undercloud.conf create
                    broken network configuration

[1176569 ] http://bugzilla.redhat.com/1176569 (NEW)
           Component: instack-undercloud
           Last change: 2016-04-18
           Summary: 404 not found when instack-virt-setup tries to download
                    the rhel-6.5 guest image

[1232029 ] http://bugzilla.redhat.com/1232029 (NEW)
           Component: instack-undercloud
           Last change: 2015-06-22
           Summary: instack-undercloud: "openstack undercloud install"
                    fails with "RuntimeError: ('%s failed. See log for
                    details.', 'os-refresh-config')"

[1230937 ] http://bugzilla.redhat.com/1230937 (NEW)
           Component: instack-undercloud
           Last change: 2016-04-18
           Summary: instack-undercloud: multiple "openstack No user with a
                    name or ID of" errors during  overcloud deployment.

[1216982 ] http://bugzilla.redhat.com/1216982 (ASSIGNED)
           Component: instack-undercloud
           Last change: 2016-04-18
           Summary: instack-build-images does not stop on certain errors

[1223977 ] http://bugzilla.redhat.com/1223977 (ASSIGNED)
           Component: instack-undercloud
           Last change: 2016-04-18
           Summary: instack-undercloud: Running "openstack undercloud
                    install" exits with error due to a missing python-
                    flask-babel package: "Error: Package: openstack-
                    tuskar-2013.2-dev1.el7.centos.noarch (delorean-rdo-
                    management)            Requires: python-flask-babel"

[1134073 ] http://bugzilla.redhat.com/1134073 (NEW)
           Component: instack-undercloud
           Last change: 2016-04-18
           Summary: Nova default quotas insufficient to deploy baremetal
                    overcloud

[1187966 ] http://bugzilla.redhat.com/1187966 (NEW)
           Component: instack-undercloud
           Last change: 2016-04-18
           Summary: missing dependency on which

[1221818 ] http://bugzilla.redhat.com/1221818 (NEW)
           Component: instack-undercloud
           Last change: 2016-04-18
           Summary: rdo-manager documentation required for RHEL7 + rdo kilo
                    (only) setup and install

[1210685 ] http://bugzilla.redhat.com/1210685 (NEW)
           Component: instack-undercloud
           Last change: 2016-04-18
           Summary: Could not retrieve facts for localhost.localhost: no
                    address for localhost.localhost (corrupted
                    /etc/resolv.conf)

[1214545 ] http://bugzilla.redhat.com/1214545 (NEW)
           Component: instack-undercloud
           Last change: 2016-04-18
           Summary: undercloud nova.conf needs reserved_host_memory_mb=0

### iproute (1 bug)


[1173435 ] http://bugzilla.redhat.com/1173435 (NEW)
           Component: iproute
           Last change: 2016-04-18
           Summary: deleting netns ends in  Device or resource busy and
                    blocks further namespace usage

### openstack-ceilometer (3 bugs)


[1314465 ] http://bugzilla.redhat.com/1314465 (NEW)
           Component: openstack-ceilometer
           Last change: 2016-04-18
           Summary: openstack-aodh-expirer does not looks like a regular
                    service

[1265741 ] http://bugzilla.redhat.com/1265741 (NEW)
           Component: openstack-ceilometer
           Last change: 2016-04-18
           Summary: python-redis is not installed with packstack allinone

[1219376 ] http://bugzilla.redhat.com/1219376 (NEW)
           Component: openstack-ceilometer
           Last change: 2016-04-18
           Summary: Wrong alarms order on 'severity' field

### openstack-cinder (13 bugs)


[1301158 ] http://bugzilla.redhat.com/1301158 (NEW)
           Component: openstack-cinder
           Last change: 2016-04-19
           Summary: openstack-cinder now requires google-api-python-
                    client>=1.4.2

[1157939 ] http://bugzilla.redhat.com/1157939 (ASSIGNED)
           Component: openstack-cinder
           Last change: 2016-04-19
           Summary: Default binary for iscsi_helper (lioadm) does not exist
                    in the repos

[1167156 ] http://bugzilla.redhat.com/1167156 (NEW)
           Component: openstack-cinder
           Last change: 2016-04-19
           Summary: cinder-api[14407]: segfault at 7fc84636f7e0 ip
                    00007fc84636f7e0 sp 00007fff3110a468 error 15 in
                    multiarray.so[7fc846369000+d000]

[1178648 ] http://bugzilla.redhat.com/1178648 (NEW)
           Component: openstack-cinder
           Last change: 2016-04-19
           Summary: vmware: "Not authenticated error occurred " on delete
                    volume

[1310776 ] http://bugzilla.redhat.com/1310776 (NEW)
           Component: openstack-cinder
           Last change: 2016-04-19
           Summary: iscsi targets loses acl data after hard reboot

[1290415 ] http://bugzilla.redhat.com/1290415 (NEW)
           Component: openstack-cinder
           Last change: 2016-04-19
           Summary: Error: Unable to retrieve volume limit information when
                    accessing System Defaults in Horizon

[1268182 ] http://bugzilla.redhat.com/1268182 (NEW)
           Component: openstack-cinder
           Last change: 2016-04-19
           Summary: cinder spontaneously sets instance root device to
                    'available'

[1049535 ] http://bugzilla.redhat.com/1049535 (NEW)
           Component: openstack-cinder
           Last change: 2016-04-19
           Summary: [RFE] permit cinder to create a volume when root_squash
                    is set to on for gluster storage

[1206864 ] http://bugzilla.redhat.com/1206864 (NEW)
           Component: openstack-cinder
           Last change: 2016-04-19
           Summary: cannot attach local cinder volume

[1121256 ] http://bugzilla.redhat.com/1121256 (NEW)
           Component: openstack-cinder
           Last change: 2016-04-19
           Summary: Configuration file in share forces ignore of auth_uri

[1229551 ] http://bugzilla.redhat.com/1229551 (ASSIGNED)
           Component: openstack-cinder
           Last change: 2016-04-19
           Summary: Nova resize fails with iSCSI logon failure when booting
                    from volume

[1212899 ] http://bugzilla.redhat.com/1212899 (ASSIGNED)
           Component: openstack-cinder
           Last change: 2016-04-19
           Summary: [packaging] missing dependencies for openstack-cinder

[1028688 ] http://bugzilla.redhat.com/1028688 (ASSIGNED)
           Component: openstack-cinder
           Last change: 2016-04-18
           Summary: should use new names in cinder-dist.conf

### openstack-foreman-installer (2 bugs)


[1203292 ] http://bugzilla.redhat.com/1203292 (NEW)
           Component: openstack-foreman-installer
           Last change: 2016-04-18
           Summary: [RFE] Openstack Installer should install and configure
                    SPICE to work with Nova and Horizon

[1205782 ] http://bugzilla.redhat.com/1205782 (NEW)
           Component: openstack-foreman-installer
           Last change: 2016-04-18
           Summary: support the ldap user_enabled_invert parameter

### openstack-glance (3 bugs)


[1208798 ] http://bugzilla.redhat.com/1208798 (NEW)
           Component: openstack-glance
           Last change: 2016-04-19
           Summary: Split glance-api and glance-registry

[1312466 ] http://bugzilla.redhat.com/1312466 (NEW)
           Component: openstack-glance
           Last change: 2016-04-19
           Summary: Support for blueprint cinder-store-upload-download in
                    glance_store

[1213545 ] http://bugzilla.redhat.com/1213545 (NEW)
           Component: openstack-glance
           Last change: 2016-04-19
           Summary: [packaging] missing dependencies for openstack-glance-
                    common: python-glance

### openstack-heat (5 bugs)


[1216917 ] http://bugzilla.redhat.com/1216917 (NEW)
           Component: openstack-heat
           Last change: 2016-04-19
           Summary: Clearing non-existing hooks yields no error message

[1291047 ] http://bugzilla.redhat.com/1291047 (NEW)
           Component: openstack-heat
           Last change: 2016-04-19
           Summary: (RDO Mitaka) Overcloud deployment failed: Exceeded max
                    scheduling attempts

[1293961 ] http://bugzilla.redhat.com/1293961 (ASSIGNED)
           Component: openstack-heat
           Last change: 2016-04-19
           Summary: [SFCI] Heat template failed to start because Property
                    error: ... net_cidr (constraint not found)

[1228324 ] http://bugzilla.redhat.com/1228324 (NEW)
           Component: openstack-heat
           Last change: 2016-04-19
           Summary: When deleting the stack, a bare metal node goes to
                    ERROR state and is not deleted

[1235472 ] http://bugzilla.redhat.com/1235472 (NEW)
           Component: openstack-heat
           Last change: 2016-04-19
           Summary: SoftwareDeployment resource attributes are null

### openstack-horizon (3 bugs)


[1316534 ] http://bugzilla.redhat.com/1316534 (NEW)
           Component: openstack-horizon
           Last change: 2016-03-10
           Summary: some webfonts not found when using material theme

[1248634 ] http://bugzilla.redhat.com/1248634 (NEW)
           Component: openstack-horizon
           Last change: 2015-09-02
           Summary: Horizon Create volume from Image not mountable

[1275656 ] http://bugzilla.redhat.com/1275656 (NEW)
           Component: openstack-horizon
           Last change: 2015-10-28
           Summary: FontAwesome lib bad path

### openstack-ironic (4 bugs)


[1300509 ] http://bugzilla.redhat.com/1300509 (NEW)
           Component: openstack-ironic
           Last change: 2016-01-21
           Summary: ironic should have its own log file

[1217505 ] http://bugzilla.redhat.com/1217505 (NEW)
           Component: openstack-ironic
           Last change: 2016-04-18
           Summary: IPMI driver for Ironic should support RAID for
                    operating system/root parition

[1301153 ] http://bugzilla.redhat.com/1301153 (NEW)
           Component: openstack-ironic
           Last change: 2016-01-22
           Summary: ironic logs huge

[1221472 ] http://bugzilla.redhat.com/1221472 (NEW)
           Component: openstack-ironic
           Last change: 2015-05-14
           Summary: Error message is not clear: Node can not be updated
                    while a state transition is in progress. (HTTP 409)

### openstack-ironic-discoverd (2 bugs)


[1322892 ] http://bugzilla.redhat.com/1322892 (ASSIGNED)
           Component: openstack-ironic-discoverd
           Last change: 2016-04-14
           Summary: No valid interfaces found during introspection

[1211069 ] http://bugzilla.redhat.com/1211069 (ASSIGNED)
           Component: openstack-ironic-discoverd
           Last change: 2016-02-26
           Summary: [RFE] [RDO-Manager] [discoverd] Add possibility to kill
                    node discovery

### openstack-keystone (9 bugs)


[1289267 ] http://bugzilla.redhat.com/1289267 (NEW)
           Component: openstack-keystone
           Last change: 2016-04-19
           Summary: Mitaka: keystone.py is deprecated for WSGI
                    implementation

[1208934 ] http://bugzilla.redhat.com/1208934 (NEW)
           Component: openstack-keystone
           Last change: 2016-04-19
           Summary: Need to include SSO callback form in the openstack-
                    keystone RPM

[1220489 ] http://bugzilla.redhat.com/1220489 (NEW)
           Component: openstack-keystone
           Last change: 2016-04-19
           Summary: wrong log directories in /usr/share/keystone/wsgi-
                    keystone.conf

[1212126 ] http://bugzilla.redhat.com/1212126 (NEW)
           Component: openstack-keystone
           Last change: 2016-04-19
           Summary: keystone: add token flush cronjob script to keystone
                    package

[1280530 ] http://bugzilla.redhat.com/1280530 (NEW)
           Component: openstack-keystone
           Last change: 2016-04-19
           Summary: Fernet tokens cannot read key files with SELInuxz
                    enabeld

[1218644 ] http://bugzilla.redhat.com/1218644 (ASSIGNED)
           Component: openstack-keystone
           Last change: 2016-04-19
           Summary: CVE-2015-3646 openstack-keystone: cache backend
                    password leak in log (OSSA 2015-008) [openstack-rdo]

[1284871 ] http://bugzilla.redhat.com/1284871 (NEW)
           Component: openstack-keystone
           Last change: 2016-04-19
           Summary: /usr/share/keystone/wsgi-keystone.conf is missing
                    group=keystone

[1167528 ] http://bugzilla.redhat.com/1167528 (NEW)
           Component: openstack-keystone
           Last change: 2016-04-19
           Summary: assignment table migration fails for keystone-manage
                    db_sync if duplicate entry exists

[1217663 ] http://bugzilla.redhat.com/1217663 (NEW)
           Component: openstack-keystone
           Last change: 2016-04-19
           Summary: Overridden default for Token Provider points to non-
                    existent class

### openstack-manila (12 bugs)


[1324783 ] http://bugzilla.redhat.com/1324783 (NEW)
           Component: openstack-manila
           Last change: 2016-04-07
           Summary: state_path/lock_path does not have the sane defaults

[1278918 ] http://bugzilla.redhat.com/1278918 (NEW)
           Component: openstack-manila
           Last change: 2015-12-06
           Summary: manila-api fails to start without updates from upstream
                    stable/liberty

[1272957 ] http://bugzilla.redhat.com/1272957 (NEW)
           Component: openstack-manila
           Last change: 2015-10-19
           Summary: gluster driver: same volumes are re-used with vol
                    mapped layout after restarting manila services

[1277787 ] http://bugzilla.redhat.com/1277787 (NEW)
           Component: openstack-manila
           Last change: 2015-11-04
           Summary: Glusterfs_driver: Export location for Glusterfs NFS-
                    Ganesha is incorrect

[1272960 ] http://bugzilla.redhat.com/1272960 (NEW)
           Component: openstack-manila
           Last change: 2015-10-19
           Summary: glusterfs_driver: Glusterfs NFS-Ganesha share's export
                    location should be uniform for both nfsv3 & nfsv4
                    protocols

[1277792 ] http://bugzilla.redhat.com/1277792 (NEW)
           Component: openstack-manila
           Last change: 2015-11-04
           Summary: glusterfs_driver: Access-deny for glusterfs driver
                    should be dynamic

[1278919 ] http://bugzilla.redhat.com/1278919 (NEW)
           Component: openstack-manila
           Last change: 2015-12-06
           Summary: AvailabilityZoneFilter is not working in manila-
                    scheduler

[1272962 ] http://bugzilla.redhat.com/1272962 (NEW)
           Component: openstack-manila
           Last change: 2015-10-19
           Summary: glusterfs_driver: Attempt to create share fails
                    ungracefully when backend gluster volumes aren't
                    exported

[1272970 ] http://bugzilla.redhat.com/1272970 (NEW)
           Component: openstack-manila
           Last change: 2015-10-19
           Summary: glusterfs_native: cannot connect via SSH using password
                    authentication to multiple gluster clusters with
                    different passwords

[1272968 ] http://bugzilla.redhat.com/1272968 (NEW)
           Component: openstack-manila
           Last change: 2015-10-19
           Summary: glusterfs vol based layout: Deleting a share created
                    from snapshot should also delete its backend gluster
                    volume

[1324796 ] http://bugzilla.redhat.com/1324796 (NEW)
           Component: openstack-manila
           Last change: 2016-04-07
           Summary: openstack-manila-data.service stars manila-share
                    instead of manila-data

[1272958 ] http://bugzilla.redhat.com/1272958 (NEW)
           Component: openstack-manila
           Last change: 2015-10-19
           Summary: gluster driver - vol based layout: share size may be
                    misleading

### openstack-neutron (13 bugs)


[1065826 ] http://bugzilla.redhat.com/1065826 (ASSIGNED)
           Component: openstack-neutron
           Last change: 2016-04-19
           Summary: [RFE] [neutron] neutron services needs more RPM
                    granularity

[1282403 ] http://bugzilla.redhat.com/1282403 (NEW)
           Component: openstack-neutron
           Last change: 2016-04-19
           Summary: Errors when running tempest.api.network.test_ports with
                    IPAM reference driver enabled

[1180201 ] http://bugzilla.redhat.com/1180201 (NEW)
           Component: openstack-neutron
           Last change: 2016-04-19
           Summary: neutron-netns-cleanup.service needs RemainAfterExit=yes
                    and PrivateTmp=false

[1254275 ] http://bugzilla.redhat.com/1254275 (NEW)
           Component: openstack-neutron
           Last change: 2016-04-19
           Summary: neutron-dhcp-agent.service is not enabled after
                    packstack deploy

[1164230 ] http://bugzilla.redhat.com/1164230 (NEW)
           Component: openstack-neutron
           Last change: 2016-04-19
           Summary: In openstack-neutron-sriov-nic-agent package is missing
                    the /etc/neutron/plugins/ml2/ml2_conf_sriov.ini config
                    files

[1226006 ] http://bugzilla.redhat.com/1226006 (NEW)
           Component: openstack-neutron
           Last change: 2016-04-19
           Summary: Option "username" from group "keystone_authtoken" is
                    deprecated. Use option "username" from group
                    "keystone_authtoken".

[1327549 ] http://bugzilla.redhat.com/1327549 (NEW)
           Component: openstack-neutron
           Last change: 2016-04-19
           Summary: RDO package wrong config section in sriov_agent.ini

[1266381 ] http://bugzilla.redhat.com/1266381 (NEW)
           Component: openstack-neutron
           Last change: 2016-04-19
           Summary: OpenStack Liberty QoS feature is not working on EL7 as
                    is need MySQL-python-1.2.5

[1281308 ] http://bugzilla.redhat.com/1281308 (NEW)
           Component: openstack-neutron
           Last change: 2016-04-19
           Summary: QoS policy is not enforced when using a previously used
                    port

[1147152 ] http://bugzilla.redhat.com/1147152 (NEW)
           Component: openstack-neutron
           Last change: 2016-04-19
           Summary: Use neutron-sanity-check in CI checks

[1280258 ] http://bugzilla.redhat.com/1280258 (NEW)
           Component: openstack-neutron
           Last change: 2016-04-19
           Summary: tenants seem like they are able to detach admin
                    enforced QoS policies from ports or networks

[1259351 ] http://bugzilla.redhat.com/1259351 (NEW)
           Component: openstack-neutron
           Last change: 2016-04-19
           Summary: Neutron API behind SSL terminating haproxy returns http
                    version URL's instead of https

[1310551 ] http://bugzilla.redhat.com/1310551 (ASSIGNED)
           Component: openstack-neutron
           Last change: 2016-04-19
           Summary: Instance network can't work properly when I try to use
                    two nic in one nic

### openstack-nova (25 bugs)


[1228836 ] http://bugzilla.redhat.com/1228836 (NEW)
           Component: openstack-nova
           Last change: 2016-04-18
           Summary: Is there a way to configure IO throttling for RBD
                    devices via configuration file

[1180129 ] http://bugzilla.redhat.com/1180129 (NEW)
           Component: openstack-nova
           Last change: 2016-04-18
           Summary: Installation of openstack-nova-compute fails on
                    PowerKVM

[1157690 ] http://bugzilla.redhat.com/1157690 (NEW)
           Component: openstack-nova
           Last change: 2016-04-18
           Summary: v4-fixed-ip= not working with juno nova networking

[1200701 ] http://bugzilla.redhat.com/1200701 (NEW)
           Component: openstack-nova
           Last change: 2016-04-18
           Summary: openstack-nova-novncproxy.service in failed state -
                    need upgraded websockify version

[1229301 ] http://bugzilla.redhat.com/1229301 (NEW)
           Component: openstack-nova
           Last change: 2016-04-18
           Summary: used_now is really used_max, and used_max is really
                    used_now in "nova host-describe"

[1234837 ] http://bugzilla.redhat.com/1234837 (NEW)
           Component: openstack-nova
           Last change: 2016-04-18
           Summary: Kilo assigning ipv6 address, even though its disabled.

[1161915 ] http://bugzilla.redhat.com/1161915 (NEW)
           Component: openstack-nova
           Last change: 2016-04-18
           Summary: horizon console uses http when horizon is set to use
                    ssl

[1213547 ] http://bugzilla.redhat.com/1213547 (NEW)
           Component: openstack-nova
           Last change: 2016-04-18
           Summary: launching 20 VMs at once via a heat resource group
                    causes nova to not record some IPs correctly

[1154152 ] http://bugzilla.redhat.com/1154152 (NEW)
           Component: openstack-nova
           Last change: 2016-04-18
           Summary: [nova] hw:numa_nodes=0 causes divide by zero

[1161920 ] http://bugzilla.redhat.com/1161920 (NEW)
           Component: openstack-nova
           Last change: 2016-04-18
           Summary: novnc init script doesnt write to log

[1123298 ] http://bugzilla.redhat.com/1123298 (ASSIGNED)
           Component: openstack-nova
           Last change: 2016-04-18
           Summary: logrotate should copytruncate to avoid openstack
                    logging to deleted files

[1271033 ] http://bugzilla.redhat.com/1271033 (NEW)
           Component: openstack-nova
           Last change: 2016-04-18
           Summary: nova.conf.sample is out of date

[1154201 ] http://bugzilla.redhat.com/1154201 (NEW)
           Component: openstack-nova
           Last change: 2016-04-18
           Summary: [nova][PCI-Passthrough] TypeError: pop() takes at most
                    1 argument (2 given)

[1312605 ] http://bugzilla.redhat.com/1312605 (NEW)
           Component: openstack-nova
           Last change: 2016-04-18
           Summary: Failure to install RDO Kilo via packstack on Fedora 23

[1278808 ] http://bugzilla.redhat.com/1278808 (NEW)
           Component: openstack-nova
           Last change: 2016-04-18
           Summary: Guest fails to use more than 1 vCPU with smpboot:
                    do_boot_cpu failed(-1) to wakeup

[1190815 ] http://bugzilla.redhat.com/1190815 (NEW)
           Component: openstack-nova
           Last change: 2016-04-18
           Summary: Nova - db connection string present on compute nodes

[1149682 ] http://bugzilla.redhat.com/1149682 (NEW)
           Component: openstack-nova
           Last change: 2016-04-18
           Summary: nova object store allow get object after date exires

[1148526 ] http://bugzilla.redhat.com/1148526 (NEW)
           Component: openstack-nova
           Last change: 2016-04-18
           Summary: nova: fail to edit project quota with DataError from
                    nova

[1294747 ] http://bugzilla.redhat.com/1294747 (NEW)
           Component: openstack-nova
           Last change: 2016-04-19
           Summary: Migration fails when the SRIOV  PF is not online

[1086247 ] http://bugzilla.redhat.com/1086247 (ASSIGNED)
           Component: openstack-nova
           Last change: 2016-04-19
           Summary: Ensure translations are installed correctly and picked
                    up at runtime

[1314556 ] http://bugzilla.redhat.com/1314556 (NEW)
           Component: openstack-nova
           Last change: 2016-04-18
           Summary: ERROR (Unauthorized): The request you have made
                    requires authentication. (HTTP 401)

[1189931 ] http://bugzilla.redhat.com/1189931 (NEW)
           Component: openstack-nova
           Last change: 2016-04-18
           Summary: Nova AVC messages

[1316063 ] http://bugzilla.redhat.com/1316063 (NEW)
           Component: openstack-nova
           Last change: 2016-04-18
           Summary: /var/lib/nova/instances/ should not be world
                    readable/listable

[1300611 ] http://bugzilla.redhat.com/1300611 (NEW)
           Component: openstack-nova
           Last change: 2016-04-18
           Summary: filter instances by ip not work

[1302804 ] http://bugzilla.redhat.com/1302804 (NEW)
           Component: openstack-nova
           Last change: 2016-04-18
           Summary: Block migration results in error "AttributeError:
                    'dict' object has no attribute
                    'is_shared_instance_path'"

### openstack-packstack (100 bugs)


[1202922 ] http://bugzilla.redhat.com/1202922 (NEW)
           Component: openstack-packstack
           Last change: 2016-04-18
           Summary: packstack key injection fails with legacy networking
                    (Nova networking)

[1225312 ] http://bugzilla.redhat.com/1225312 (NEW)
           Component: openstack-packstack
           Last change: 2016-04-18
           Summary: Packstack Installation error - Invalid parameter
                    create_mysql_resource on Class[Galera::Server]

[1282928 ] http://bugzilla.redhat.com/1282928 (ASSIGNED)
           Component: openstack-packstack
           Last change: 2016-04-18
           Summary: Trove-api fails to start when deployed using packstack
                    on RHEL 7.2 RC1.1

[1203444 ] http://bugzilla.redhat.com/1203444 (NEW)
           Component: openstack-packstack
           Last change: 2016-04-18
           Summary: "private" network created by packstack is not owned by
                    any tenant

[1171811 ] http://bugzilla.redhat.com/1171811 (NEW)
           Component: openstack-packstack
           Last change: 2016-04-18
           Summary: misleading exit message on fail

[1284182 ] http://bugzilla.redhat.com/1284182 (NEW)
           Component: openstack-packstack
           Last change: 2016-04-18
           Summary: Unable start Keystone, core dump

[1296844 ] http://bugzilla.redhat.com/1296844 (NEW)
           Component: openstack-packstack
           Last change: 2016-04-18
           Summary: RDO Kilo packstack AIO install fails on CentOS 7.2.
                    Error: Unable to connect to mongodb server!
                    (192.169.142.54:27017)

[1315725 ] http://bugzilla.redhat.com/1315725 (NEW)
           Component: openstack-packstack
           Last change: 2016-04-18
           Summary: Packstack fails to configure Compute Node doing
                    ML2&OVS&VLAN deployment

[1319377 ] http://bugzilla.redhat.com/1319377 (NEW)
           Component: openstack-packstack
           Last change: 2016-04-18
           Summary: Error: Invalid parameter public_url on
                    Class[Gnocchi::Keystone::Auth]

[1207248 ] http://bugzilla.redhat.com/1207248 (NEW)
           Component: openstack-packstack
           Last change: 2016-04-18
           Summary: auto enablement of the extras channel

[1271246 ] http://bugzilla.redhat.com/1271246 (NEW)
           Component: openstack-packstack
           Last change: 2016-04-18
           Summary: packstack failed to start nova.api

[1297692 ] http://bugzilla.redhat.com/1297692 (ON_DEV)
           Component: openstack-packstack
           Last change: 2016-04-18
           Summary: Raise MariaDB max connections limit

[1148468 ] http://bugzilla.redhat.com/1148468 (NEW)
           Component: openstack-packstack
           Last change: 2016-04-18
           Summary: proposal to use the Red Hat tempest rpm to configure a
                    demo environment and configure tempest

[1176833 ] http://bugzilla.redhat.com/1176833 (NEW)
           Component: openstack-packstack
           Last change: 2016-04-18
           Summary: packstack --allinone fails when starting neutron server

[1169742 ] http://bugzilla.redhat.com/1169742 (NEW)
           Component: openstack-packstack
           Last change: 2016-04-18
           Summary: Error: service-update is not currently supported by the
                    keystone sql driver

[1188491 ] http://bugzilla.redhat.com/1188491 (ASSIGNED)
           Component: openstack-packstack
           Last change: 2016-04-18
           Summary: Packstack wording is unclear for demo and testing
                    provisioning.

[1244337 ] http://bugzilla.redhat.com/1244337 (NEW)
           Component: openstack-packstack
           Last change: 2016-04-19
           Summary: Tune WSGIDaemonProcess processes/threads configuration

[1201612 ] http://bugzilla.redhat.com/1201612 (ASSIGNED)
           Component: openstack-packstack
           Last change: 2016-04-18
           Summary: Interactive - Packstack asks for Tempest details even
                    when Tempest install is declined

[1176433 ] http://bugzilla.redhat.com/1176433 (NEW)
           Component: openstack-packstack
           Last change: 2016-04-18
           Summary: packstack fails to configure horizon - juno/rhel7 (vm)

[982035  ] http://bugzilla.redhat.com/982035 (ASSIGNED)
           Component: openstack-packstack
           Last change: 2016-04-19
           Summary: [RFE] Include Fedora cloud images in some nice way

[1061753 ] http://bugzilla.redhat.com/1061753 (NEW)
           Component: openstack-packstack
           Last change: 2016-04-19
           Summary: [RFE] Create an option in packstack to increase
                    verbosity level of libvirt

[1160885 ] http://bugzilla.redhat.com/1160885 (NEW)
           Component: openstack-packstack
           Last change: 2016-04-18
           Summary: rabbitmq wont start if ssl is required

[1202958 ] http://bugzilla.redhat.com/1202958 (NEW)
           Component: openstack-packstack
           Last change: 2016-04-18
           Summary: Packstack generates invalid /etc/sysconfig/network-
                    scripts/ifcfg-br-ex

[1298364 ] http://bugzilla.redhat.com/1298364 (NEW)
           Component: openstack-packstack
           Last change: 2016-04-18
           Summary: rdo liberty install centos 7 nova-network
                    error:CONFIG_NEUTRON_METADATA_PW_UNQUOTED

[1324070 ] http://bugzilla.redhat.com/1324070 (NEW)
           Component: openstack-packstack
           Last change: 2016-04-18
           Summary: RFE: PackStack Support for LBaaSv2

[1292271 ] http://bugzilla.redhat.com/1292271 (NEW)
           Component: openstack-packstack
           Last change: 2016-04-19
           Summary: Receive Msg 'Error: Could not find user glance'

[1275803 ] http://bugzilla.redhat.com/1275803 (NEW)
           Component: openstack-packstack
           Last change: 2016-04-18
           Summary: packstack --allinone fails on Fedora 22-3 during
                    _keystone.pp

[1244407 ] http://bugzilla.redhat.com/1244407 (NEW)
           Component: openstack-packstack
           Last change: 2016-04-18
           Summary: Deploying ironic kilo with packstack fails

[1097291 ] http://bugzilla.redhat.com/1097291 (NEW)
           Component: openstack-packstack
           Last change: 2016-04-18
           Summary: [RFE] SPICE support in packstack

[1255369 ] http://bugzilla.redhat.com/1255369 (NEW)
           Component: openstack-packstack
           Last change: 2016-04-18
           Summary: Improve session settings for horizon

[1012382 ] http://bugzilla.redhat.com/1012382 (ON_DEV)
           Component: openstack-packstack
           Last change: 2016-04-19
           Summary: swift: Admin user does not have permissions to see
                    containers created by glance service

[1254389 ] http://bugzilla.redhat.com/1254389 (ASSIGNED)
           Component: openstack-packstack
           Last change: 2016-04-18
           Summary: Can no longer run packstack to maintain cluster

[1100142 ] http://bugzilla.redhat.com/1100142 (NEW)
           Component: openstack-packstack
           Last change: 2016-04-18
           Summary: Packstack missing ML2 Mellanox Mechanism Driver

[953586  ] http://bugzilla.redhat.com/953586 (NEW)
           Component: openstack-packstack
           Last change: 2016-04-18
           Summary: [RFE] Openstack Installer: packstack should install and
                    configure SPICE to work with Nova and Horizon

[1206742 ] http://bugzilla.redhat.com/1206742 (NEW)
           Component: openstack-packstack
           Last change: 2016-04-18
           Summary: Installed epel-release prior to running packstack,
                    packstack disables it on invocation

[1232455 ] http://bugzilla.redhat.com/1232455 (NEW)
           Component: openstack-packstack
           Last change: 2016-04-18
           Summary: Errors install kilo on fedora21

[1187572 ] http://bugzilla.redhat.com/1187572 (NEW)
           Component: openstack-packstack
           Last change: 2016-04-18
           Summary: RFE: allow to set certfile for
                    /etc/rabbitmq/rabbitmq.config

[1239286 ] http://bugzilla.redhat.com/1239286 (NEW)
           Component: openstack-packstack
           Last change: 2016-04-18
           Summary: ERROR: cliff.app 'super' object has no attribute
                    'load_commands'

[1063393 ] http://bugzilla.redhat.com/1063393 (ASSIGNED)
           Component: openstack-packstack
           Last change: 2016-04-18
           Summary: RFE: Provide option to set bind_host/bind_port for API
                    services

[1316565 ] http://bugzilla.redhat.com/1316565 (NEW)
           Component: openstack-packstack
           Last change: 2016-04-18
           Summary: [RDO Mitaka3 test day] When Ironic installation is
                    enabled nova-compute fails to start

[1316222 ] http://bugzilla.redhat.com/1316222 (NEW)
           Component: openstack-packstack
           Last change: 2016-04-18
           Summary: Packstack installation failed due to wrong http config

[1291492 ] http://bugzilla.redhat.com/1291492 (NEW)
           Component: openstack-packstack
           Last change: 2016-04-18
           Summary: Unfriendly behavior of IP filtering for VXLAN with
                    EXCLUDE_SERVERS

[1226393 ] http://bugzilla.redhat.com/1226393 (NEW)
           Component: openstack-packstack
           Last change: 2016-04-18
           Summary: CONFIG_PROVISION_DEMO=n causes packstack to fail

[1232496 ] http://bugzilla.redhat.com/1232496 (NEW)
           Component: openstack-packstack
           Last change: 2016-04-18
           Summary: Error during puppet run causes install to fail, says
                    rabbitmq.com cannot be reached when it can

[1326958 ] http://bugzilla.redhat.com/1326958 (NEW)
           Component: openstack-packstack
           Last change: 2016-04-18
           Summary: [mitaka] Nagios plugin "glance-index" uses old syntax

[1269535 ] http://bugzilla.redhat.com/1269535 (NEW)
           Component: openstack-packstack
           Last change: 2016-04-18
           Summary: packstack script does not test to see if the rc files
                    *were* created.

[1247816 ] http://bugzilla.redhat.com/1247816 (NEW)
           Component: openstack-packstack
           Last change: 2016-04-18
           Summary: rdo liberty trunk; nova compute fails to start

[1282746 ] http://bugzilla.redhat.com/1282746 (NEW)
           Component: openstack-packstack
           Last change: 2016-04-18
           Summary: Swift's proxy-server is not configured to use
                    ceilometer

[1242647 ] http://bugzilla.redhat.com/1242647 (NEW)
           Component: openstack-packstack
           Last change: 2016-04-18
           Summary: Nova keypair doesn't work with Nova Networking

[1167121 ] http://bugzilla.redhat.com/1167121 (NEW)
           Component: openstack-packstack
           Last change: 2016-04-18
           Summary: centos7 fails to install glance

[1326887 ] http://bugzilla.redhat.com/1326887 (NEW)
           Component: openstack-packstack
           Last change: 2016-04-18
           Summary: [Mitaka] Packstack fails if --os-horizon-ssl=y

[1239027 ] http://bugzilla.redhat.com/1239027 (NEW)
           Component: openstack-packstack
           Last change: 2016-04-18
           Summary: please move httpd log files to corresponding dirs

[1107908 ] http://bugzilla.redhat.com/1107908 (NEW)
           Component: openstack-packstack
           Last change: 2016-04-18
           Summary: Offset Swift ports to 6200

[1116019 ] http://bugzilla.redhat.com/1116019 (ASSIGNED)
           Component: openstack-packstack
           Last change: 2016-04-18
           Summary: AMQP1.0 server configurations needed

[1266196 ] http://bugzilla.redhat.com/1266196 (NEW)
           Component: openstack-packstack
           Last change: 2016-04-18
           Summary: Packstack Fails on prescript.pp with "undefined method
                    'unsafe_load_file' for Psych:Module"

[1312487 ] http://bugzilla.redhat.com/1312487 (ASSIGNED)
           Component: openstack-packstack
           Last change: 2016-04-18
           Summary: Packstack with Swift Glance backend does not seem to
                    work

[1184806 ] http://bugzilla.redhat.com/1184806 (NEW)
           Component: openstack-packstack
           Last change: 2016-04-18
           Summary: [RFE] Packstack should support deploying Nova and
                    Glance with RBD images and Ceph as a backend

[1270770 ] http://bugzilla.redhat.com/1270770 (NEW)
           Component: openstack-packstack
           Last change: 2016-04-18
           Summary: Packstack generated
                    CONFIG_MANILA_SERVICE_IMAGE_LOCATION points to a
                    dropbox link

[1172310 ] http://bugzilla.redhat.com/1172310 (ASSIGNED)
           Component: openstack-packstack
           Last change: 2016-04-19
           Summary: support Keystone LDAP

[1155722 ] http://bugzilla.redhat.com/1155722 (NEW)
           Component: openstack-packstack
           Last change: 2016-04-18
           Summary: [delorean]  ArgumentError: Invalid resource type
                    database_user at /var/tmp/packstack/<snip>/manifests/17
                    2.16.32.71_mariadb.pp:28 on node

[1279642 ] http://bugzilla.redhat.com/1279642 (NEW)
           Component: openstack-packstack
           Last change: 2016-04-18
           Summary: Packstack run fails when running with DEMO

[1213149 ] http://bugzilla.redhat.com/1213149 (NEW)
           Component: openstack-packstack
           Last change: 2016-04-19
           Summary: openstack-keystone service is in " failed " status when
                    CONFIG_KEYSTONE_SERVICE_NAME=httpd

[1200129 ] http://bugzilla.redhat.com/1200129 (ASSIGNED)
           Component: openstack-packstack
           Last change: 2016-04-18
           Summary: [RFE] add support for ceilometer workload partitioning
                    via tooz/redis

[1194678 ] http://bugzilla.redhat.com/1194678 (NEW)
           Component: openstack-packstack
           Last change: 2016-04-18
           Summary: On aarch64, nova.conf should default to
                    vnc_enabled=False

[1293693 ] http://bugzilla.redhat.com/1293693 (NEW)
           Component: openstack-packstack
           Last change: 2016-04-18
           Summary: Keystone setup fails on missing required parameter

[1176797 ] http://bugzilla.redhat.com/1176797 (NEW)
           Component: openstack-packstack
           Last change: 2016-04-18
           Summary: packstack --allinone on CentOS 7 VM fails at cinder
                    puppet manifest

[1286995 ] http://bugzilla.redhat.com/1286995 (NEW)
           Component: openstack-packstack
           Last change: 2016-04-18
           Summary: PackStack should configure LVM filtering with LVM/iSCSI

[1235948 ] http://bugzilla.redhat.com/1235948 (NEW)
           Component: openstack-packstack
           Last change: 2016-04-18
           Summary: Error occurred at during setup Ironic via packstack.
                    Invalid parameter rabbit_user

[1209206 ] http://bugzilla.redhat.com/1209206 (NEW)
           Component: openstack-packstack
           Last change: 2016-04-18
           Summary: packstack --allinone fails - CentOS7 ; fresh install :
                    Error: /Stage[main]/Apache::Service/Service[httpd]

[1279641 ] http://bugzilla.redhat.com/1279641 (NEW)
           Component: openstack-packstack
           Last change: 2016-04-18
           Summary: Packstack run does not install keystoneauth1

[1254447 ] http://bugzilla.redhat.com/1254447 (NEW)
           Component: openstack-packstack
           Last change: 2016-04-18
           Summary: Packstack --allinone fails while starting HTTPD service

[1316610 ] http://bugzilla.redhat.com/1316610 (NEW)
           Component: openstack-packstack
           Last change: 2016-04-18
           Summary: [RDO Mitaka3 test day] Packstack should not run cli
                    commands on network hosts

[1207371 ] http://bugzilla.redhat.com/1207371 (NEW)
           Component: openstack-packstack
           Last change: 2016-04-18
           Summary: packstack --allinone fails during _keystone.pp

[1235139 ] http://bugzilla.redhat.com/1235139 (NEW)
           Component: openstack-packstack
           Last change: 2016-04-18
           Summary: [F22-Packstack-Kilo] Error: Could not find dependency
                    Package[openstack-swift] for File[/srv/node] at /var/tm
                    p/packstack/b77f37620d9f4794b6f38730442962b6/manifests/
                    xxx.xxx.xxx.xxx_swift.pp:90

[1158015 ] http://bugzilla.redhat.com/1158015 (NEW)
           Component: openstack-packstack
           Last change: 2016-04-19
           Summary: Post installation, Cinder fails with an error: Volume
                    group "cinder-volumes" not found

[1206358 ] http://bugzilla.redhat.com/1206358 (NEW)
           Component: openstack-packstack
           Last change: 2016-04-18
           Summary: provision_glance does not honour proxy setting when
                    getting image

[1276277 ] http://bugzilla.redhat.com/1276277 (NEW)
           Component: openstack-packstack
           Last change: 2016-04-18
           Summary: packstack --allinone fails on CentOS 7 x86_64 1503-01

[903645  ] http://bugzilla.redhat.com/903645 (ASSIGNED)
           Component: openstack-packstack
           Last change: 2016-04-18
           Summary: RFE: Include the ability in PackStack to support SSL
                    for all REST services and message bus communication

[1185627 ] http://bugzilla.redhat.com/1185627 (NEW)
           Component: openstack-packstack
           Last change: 2016-04-18
           Summary: glance provision disregards keystone region setting

[1214922 ] http://bugzilla.redhat.com/1214922 (NEW)
           Component: openstack-packstack
           Last change: 2016-04-18
           Summary: Cannot use ipv6 address for cinder nfs backend.

[1249169 ] http://bugzilla.redhat.com/1249169 (NEW)
           Component: openstack-packstack
           Last change: 2016-04-18
           Summary: FWaaS does not work because DB was not synced

[1320644 ] http://bugzilla.redhat.com/1320644 (NEW)
           Component: openstack-packstack
           Last change: 2016-04-18
           Summary: Packstack fails to configure Compute Node doing
                    ML2&OVS&VLAN deployment  (Mitaka build 20160322)

[1265816 ] http://bugzilla.redhat.com/1265816 (NEW)
           Component: openstack-packstack
           Last change: 2016-04-18
           Summary: Manila Puppet Module Expects Glance Endpoint to Be
                    Available for Upload of Service Image

[1289761 ] http://bugzilla.redhat.com/1289761 (NEW)
           Component: openstack-packstack
           Last change: 2016-04-18
           Summary: PackStack installs Nova crontab that nova user can't
                    run

[1310094 ] http://bugzilla.redhat.com/1310094 (NEW)
           Component: openstack-packstack
           Last change: 2016-04-18
           Summary: [CentOS7] packstack execution fails immediately on
                    freshly installed system. Complains about inexistent
                    locale.

[1286828 ] http://bugzilla.redhat.com/1286828 (NEW)
           Component: openstack-packstack
           Last change: 2016-04-18
           Summary: Packstack should have the option to install QoS
                    (neutron)

[1172467 ] http://bugzilla.redhat.com/1172467 (NEW)
           Component: openstack-packstack
           Last change: 2016-04-19
           Summary: New user cannot retrieve container listing

[1283261 ] http://bugzilla.redhat.com/1283261 (NEW)
           Component: openstack-packstack
           Last change: 2016-04-18
           Summary: ceilometer-nova is not configured

[1023533 ] http://bugzilla.redhat.com/1023533 (ASSIGNED)
           Component: openstack-packstack
           Last change: 2016-04-18
           Summary: API services has all admin permission instead of
                    service

[1207098 ] http://bugzilla.redhat.com/1207098 (NEW)
           Component: openstack-packstack
           Last change: 2016-04-18
           Summary: [RDO] packstack installation failed with "Error:
                    /Stage[main]/Apache::Service/Service[httpd]: Failed to
                    call refresh: Could not start Service[httpd]: Execution
                    of '/sbin/service httpd start' returned 1: Redirecting
                    to /bin/systemctl start  httpd.service"

[1264843 ] http://bugzilla.redhat.com/1264843 (NEW)
           Component: openstack-packstack
           Last change: 2016-04-18
           Summary: Error: Execution of '/usr/bin/yum -d 0 -e 0 -y list
                    iptables-ipv6' returned 1: Error: No matching Packages
                    to list

[1203131 ] http://bugzilla.redhat.com/1203131 (NEW)
           Component: openstack-packstack
           Last change: 2016-04-18
           Summary: Using packstack deploy openstack,when
                    CONFIG_NEUTRON_OVS_BRIDGE_IFACES=br-
                    eno50:eno50,encounters an error“ERROR : Error appeared
                    during Puppet run: 10.43.241.186_neutron.pp ”.

[1302766 ] http://bugzilla.redhat.com/1302766 (NEW)
           Component: openstack-packstack
           Last change: 2016-04-18
           Summary: Add Magnum support using puppet-magnum

[1285494 ] http://bugzilla.redhat.com/1285494 (NEW)
           Component: openstack-packstack
           Last change: 2016-04-18
           Summary: openstack-
                    packstack-7.0.0-0.5.dev1661.gaf13b7e.el7.noarch
                    cripples(?) httpd.conf

[1227298 ] http://bugzilla.redhat.com/1227298 (NEW)
           Component: openstack-packstack
           Last change: 2016-04-18
           Summary: Packstack should support MTU settings

[1187609 ] http://bugzilla.redhat.com/1187609 (ASSIGNED)
           Component: openstack-packstack
           Last change: 2016-04-18
           Summary: CONFIG_AMQP_ENABLE_SSL=y does not really set ssl on

[1208812 ] http://bugzilla.redhat.com/1208812 (NEW)
           Component: openstack-packstack
           Last change: 2016-04-18
           Summary: add DiskFilter to scheduler_default_filters

[1005073 ] http://bugzilla.redhat.com/1005073 (NEW)
           Component: openstack-packstack
           Last change: 2016-04-19
           Summary: [RFE] Please add glance and nova lib folder config

[1296899 ] http://bugzilla.redhat.com/1296899 (NEW)
           Component: openstack-packstack
           Last change: 2016-04-18
           Summary: Swift's proxy-server is not configured to use
                    ceilometer

[1168113 ] http://bugzilla.redhat.com/1168113 (ASSIGNED)
           Component: openstack-packstack
           Last change: 2016-04-18
           Summary: The warning message " NetworkManager is active "
                    appears even when the  NetworkManager is inactive

### openstack-puppet-modules (19 bugs)


[1236775 ] http://bugzilla.redhat.com/1236775 (NEW)
           Component: openstack-puppet-modules
           Last change: 2016-04-18
           Summary: rdo kilo mongo fails to start

[1288533 ] http://bugzilla.redhat.com/1288533 (NEW)
           Component: openstack-puppet-modules
           Last change: 2016-04-18
           Summary: packstack fails on installing mongodb

[1150678 ] http://bugzilla.redhat.com/1150678 (NEW)
           Component: openstack-puppet-modules
           Last change: 2016-04-18
           Summary: Permissions issue prevents CSS from rendering

[1192539 ] http://bugzilla.redhat.com/1192539 (NEW)
           Component: openstack-puppet-modules
           Last change: 2016-04-18
           Summary: Add puppet-tripleo and puppet-gnocchi to opm

[1157500 ] http://bugzilla.redhat.com/1157500 (NEW)
           Component: openstack-puppet-modules
           Last change: 2016-04-18
           Summary: ERROR: Network commands are not supported when using
                    the Neutron API.

[1222326 ] http://bugzilla.redhat.com/1222326 (NEW)
           Component: openstack-puppet-modules
           Last change: 2016-04-18
           Summary: trove conf files require update when neutron disabled

[1326848 ] http://bugzilla.redhat.com/1326848 (NEW)
           Component: openstack-puppet-modules
           Last change: 2016-04-18
           Summary: Tempest provisioning fails due to missing
                    /var/lib/tempest/tools/install_venv.py script

[1259411 ] http://bugzilla.redhat.com/1259411 (NEW)
           Component: openstack-puppet-modules
           Last change: 2016-04-18
           Summary: Backport: nova-network needs authentication

[1285900 ] http://bugzilla.redhat.com/1285900 (NEW)
           Component: openstack-puppet-modules
           Last change: 2016-04-18
           Summary: Typo in log file name for trove-guestagent

[1318332 ] http://bugzilla.redhat.com/1318332 (NEW)
           Component: openstack-puppet-modules
           Last change: 2016-04-19
           Summary: Cinder workaround should be removed

[1297535 ] http://bugzilla.redhat.com/1297535 (ASSIGNED)
           Component: openstack-puppet-modules
           Last change: 2016-04-18
           Summary: Undercloud installation fails ::aodh::keystone::auth
                    not found for instack

[1285897 ] http://bugzilla.redhat.com/1285897 (NEW)
           Component: openstack-puppet-modules
           Last change: 2016-04-18
           Summary: trove-guestagent.conf should define the configuration
                    for backups

[1155663 ] http://bugzilla.redhat.com/1155663 (NEW)
           Component: openstack-puppet-modules
           Last change: 2016-04-18
           Summary: Increase the rpc_thread_pool_size

[1174454 ] http://bugzilla.redhat.com/1174454 (ASSIGNED)
           Component: openstack-puppet-modules
           Last change: 2016-04-18
           Summary: Add puppet-openstack_extras to opm

[1107907 ] http://bugzilla.redhat.com/1107907 (NEW)
           Component: openstack-puppet-modules
           Last change: 2016-04-18
           Summary: Offset Swift ports to 6200

[1304512 ] http://bugzilla.redhat.com/1304512 (ASSIGNED)
           Component: openstack-puppet-modules
           Last change: 2016-04-18
           Summary: Packstack replaces httpd config with one without
                    conf.modules.d

[1150902 ] http://bugzilla.redhat.com/1150902 (ASSIGNED)
           Component: openstack-puppet-modules
           Last change: 2016-04-18
           Summary: selinux prevents httpd to write to
                    /var/log/horizon/horizon.log

[1316856 ] http://bugzilla.redhat.com/1316856 (NEW)
           Component: openstack-puppet-modules
           Last change: 2016-04-18
           Summary: packstack fails to configure ovs bridge for CentOS

[1240736 ] http://bugzilla.redhat.com/1240736 (NEW)
           Component: openstack-puppet-modules
           Last change: 2016-04-18
           Summary: trove guestagent config mods for integration testing

### openstack-sahara (2 bugs)


[1305790 ] http://bugzilla.redhat.com/1305790 (NEW)
           Component: openstack-sahara
           Last change: 2016-02-09
           Summary: Failure to launch Caldera 5.0.4  Hadoop Cluster via
                    Sahara Wizards on RDO Liberty

[1305419 ] http://bugzilla.redhat.com/1305419 (NEW)
           Component: openstack-sahara
           Last change: 2016-02-10
           Summary: Failure to launch Hadoop HDP 2.0.6 Cluster via Sahara
                    Wizards on RDO Liberty

### openstack-selinux (12 bugs)


[1158394 ] http://bugzilla.redhat.com/1158394 (NEW)
           Component: openstack-selinux
           Last change: 2016-04-18
           Summary: keystone-all proccess raised avc denied

[1202944 ] http://bugzilla.redhat.com/1202944 (NEW)
           Component: openstack-selinux
           Last change: 2016-04-19
           Summary: "glance image-list" fails on F21, causing packstack
                    install to fail

[1174795 ] http://bugzilla.redhat.com/1174795 (NEW)
           Component: openstack-selinux
           Last change: 2016-04-18
           Summary: keystone fails to start: raise exception.ConfigFileNotF
                    ound(config_file=paste_config_value)

[1320043 ] http://bugzilla.redhat.com/1320043 (NEW)
           Component: openstack-selinux
           Last change: 2016-04-19
           Summary: rootwrap-daemon can't start after reboot due to AVC
                    denial

[1252675 ] http://bugzilla.redhat.com/1252675 (NEW)
           Component: openstack-selinux
           Last change: 2016-04-18
           Summary: neutron-server cannot connect to port 5000 due to
                    SELinux

[1189929 ] http://bugzilla.redhat.com/1189929 (NEW)
           Component: openstack-selinux
           Last change: 2016-04-19
           Summary: Glance AVC messages

[1206740 ] http://bugzilla.redhat.com/1206740 (NEW)
           Component: openstack-selinux
           Last change: 2016-04-18
           Summary: On CentOS7.1 packstack --allinone fails to start Apache
                    because of binding error on port 5000

[1203910 ] http://bugzilla.redhat.com/1203910 (NEW)
           Component: openstack-selinux
           Last change: 2016-04-18
           Summary: Keystone requires keystone_t self:process signal;

[1202941 ] http://bugzilla.redhat.com/1202941 (NEW)
           Component: openstack-selinux
           Last change: 2016-04-19
           Summary: Glance fails to start on CentOS 7 because of selinux
                    AVC

[1284879 ] http://bugzilla.redhat.com/1284879 (NEW)
           Component: openstack-selinux
           Last change: 2016-04-18
           Summary: Keystone via mod_wsgi is missing permission to read
                    /etc/keystone/fernet-keys

[1268124 ] http://bugzilla.redhat.com/1268124 (NEW)
           Component: openstack-selinux
           Last change: 2016-04-18
           Summary: Nova rootwrap-daemon requires a selinux exception

[1255559 ] http://bugzilla.redhat.com/1255559 (NEW)
           Component: openstack-selinux
           Last change: 2016-04-18
           Summary: nova api can't be started in WSGI under httpd, blocked
                    by selinux

### openstack-swift (4 bugs)


[1169215 ] http://bugzilla.redhat.com/1169215 (NEW)
           Component: openstack-swift
           Last change: 2016-04-19
           Summary: swift-init does not interoperate with systemd swift
                    service files

[1274308 ] http://bugzilla.redhat.com/1274308 (NEW)
           Component: openstack-swift
           Last change: 2016-04-19
           Summary: Consistently occurring swift related failures in RDO
                    with a HA deployment

[1314413 ] http://bugzilla.redhat.com/1314413 (NEW)
           Component: openstack-swift
           Last change: 2016-04-19
           Summary: swift-proxy-server depends on packaging for 3 erasure
                    pllugins causing swift-proxy-server to fail to start

[1179931 ] http://bugzilla.redhat.com/1179931 (NEW)
           Component: openstack-swift
           Last change: 2016-04-19
           Summary: Variable of init script gets overwritten preventing the
                    startup of swift services when using multiple server
                    configurations

### openstack-tripleo (29 bugs)


[1221731 ] http://bugzilla.redhat.com/1221731 (NEW)
           Component: openstack-tripleo
           Last change: 2016-04-18
           Summary: Overcloud missing ceilometer keystone user and
                    endpoints

[1225390 ] http://bugzilla.redhat.com/1225390 (NEW)
           Component: openstack-tripleo
           Last change: 2016-04-18
           Summary: The role names from "openstack management role list"
                    don't match those for "openstack overcloud scale stack"

[1056109 ] http://bugzilla.redhat.com/1056109 (NEW)
           Component: openstack-tripleo
           Last change: 2016-04-18
           Summary: [RFE][tripleo]: Making the overcloud deployment fully
                    HA

[1218340 ] http://bugzilla.redhat.com/1218340 (NEW)
           Component: openstack-tripleo
           Last change: 2016-04-18
           Summary: RFE: add "scheduler_default_weighers = CapacityWeigher"
                    explicitly to cinder.conf

[1205645 ] http://bugzilla.redhat.com/1205645 (NEW)
           Component: openstack-tripleo
           Last change: 2016-04-18
           Summary: Dependency issue: python-oslo-versionedobjects is
                    required by heat and not in the delorean repos

[1225022 ] http://bugzilla.redhat.com/1225022 (NEW)
           Component: openstack-tripleo
           Last change: 2016-04-18
           Summary: When adding nodes to the cloud the update hangs and
                    takes forever

[1056106 ] http://bugzilla.redhat.com/1056106 (NEW)
           Component: openstack-tripleo
           Last change: 2016-04-18
           Summary: [RFE][ironic]: Integration of Ironic in to TripleO

[1223667 ] http://bugzilla.redhat.com/1223667 (NEW)
           Component: openstack-tripleo
           Last change: 2016-04-18
           Summary: When using 'tripleo wait_for' with the command 'nova
                    hypervisor-stats' it hangs forever

[1303614 ] http://bugzilla.redhat.com/1303614 (NEW)
           Component: openstack-tripleo
           Last change: 2016-04-18
           Summary: overcloud deployment failed AttributeError: 'Proxy'
                    object has no attribute 'api'

[1229174 ] http://bugzilla.redhat.com/1229174 (NEW)
           Component: openstack-tripleo
           Last change: 2016-04-18
           Summary: Nova computes can't resolve each other because the
                    hostnames in /etc/hosts don't include the ".novalocal"
                    suffix

[1223443 ] http://bugzilla.redhat.com/1223443 (NEW)
           Component: openstack-tripleo
           Last change: 2016-04-18
           Summary: You can still check introspection status for ironic
                    nodes that have been deleted

[1223672 ] http://bugzilla.redhat.com/1223672 (NEW)
           Component: openstack-tripleo
           Last change: 2016-04-18
           Summary: Node registration fails silently if instackenv.json is
                    badly formatted

[1277990 ] http://bugzilla.redhat.com/1277990 (NEW)
           Component: openstack-tripleo
           Last change: 2016-04-18
           Summary: openstack-ironic-inspector-dnsmasq.service: failed to
                    start during undercloud installation

[1221610 ] http://bugzilla.redhat.com/1221610 (NEW)
           Component: openstack-tripleo
           Last change: 2016-04-18
           Summary: RDO-manager beta fails to install: Deployment exited
                    with non-zero status code: 6

[1223471 ] http://bugzilla.redhat.com/1223471 (NEW)
           Component: openstack-tripleo
           Last change: 2016-04-18
           Summary: Discovery errors out even when it is successful

[1223424 ] http://bugzilla.redhat.com/1223424 (NEW)
           Component: openstack-tripleo
           Last change: 2016-04-18
           Summary: instack-deploy-overcloud should not rely on
                    instackenv.json, but should use ironic instead

[1056110 ] http://bugzilla.redhat.com/1056110 (NEW)
           Component: openstack-tripleo
           Last change: 2016-04-18
           Summary: [RFE][tripleo]: Scaling work to do during icehouse

[1226653 ] http://bugzilla.redhat.com/1226653 (NEW)
           Component: openstack-tripleo
           Last change: 2016-04-18
           Summary: The usage message for "heat resource-show" is confusing
                    and incorrect

[1218168 ] http://bugzilla.redhat.com/1218168 (NEW)
           Component: openstack-tripleo
           Last change: 2016-04-18
           Summary: ceph.service should only be running on the ceph nodes,
                    not on the controller and compute nodes

[1277980 ] http://bugzilla.redhat.com/1277980 (NEW)
           Component: openstack-tripleo
           Last change: 2016-04-18
           Summary: missing  python-proliantutils

[1211560 ] http://bugzilla.redhat.com/1211560 (NEW)
           Component: openstack-tripleo
           Last change: 2016-04-18
           Summary: instack-deploy-overcloud times out after ~3 minutes, no
                    plan or stack is created

[1226867 ] http://bugzilla.redhat.com/1226867 (NEW)
           Component: openstack-tripleo
           Last change: 2016-04-18
           Summary: Timeout in API

[1296475 ] http://bugzilla.redhat.com/1296475 (NEW)
           Component: openstack-tripleo
           Last change: 2016-04-18
           Summary: Deploying Manila is not possible due to missing
                    template

[1056112 ] http://bugzilla.redhat.com/1056112 (NEW)
           Component: openstack-tripleo
           Last change: 2016-04-18
           Summary: [RFE][tripleo]: Deploying different architecture
                    topologies with Tuskar

[1174776 ] http://bugzilla.redhat.com/1174776 (NEW)
           Component: openstack-tripleo
           Last change: 2016-04-18
           Summary: User can not login into the overcloud horizon using the
                    proper credentials

[1284664 ] http://bugzilla.redhat.com/1284664 (NEW)
           Component: openstack-tripleo
           Last change: 2016-04-18
           Summary: NtpServer is passed as string by "openstack overcloud
                    deploy"

[1056114 ] http://bugzilla.redhat.com/1056114 (NEW)
           Component: openstack-tripleo
           Last change: 2016-04-18
           Summary: [RFE][tripleo]: Implement a complete overcloud
                    installation story in the UI

[1224604 ] http://bugzilla.redhat.com/1224604 (NEW)
           Component: openstack-tripleo
           Last change: 2016-04-18
           Summary: Lots of dracut-related error messages during instack-
                    build-images

[1187352 ] http://bugzilla.redhat.com/1187352 (NEW)
           Component: openstack-tripleo
           Last change: 2016-04-18
           Summary: /usr/bin/instack-prepare-for-overcloud glance using
                    incorrect parameter

### openstack-tripleo-heat-templates (8 bugs)


[1323233 ] http://bugzilla.redhat.com/1323233 (NEW)
           Component: openstack-tripleo-heat-templates
           Last change: 2016-04-18
           Summary: [RFE] inlcude yamllint to aid in debugging heat
                    templates

[1317693 ] http://bugzilla.redhat.com/1317693 (NEW)
           Component: openstack-tripleo-heat-templates
           Last change: 2016-04-18
           Summary: RabbitMQ failures when deploying RDO with IPv6

[1236760 ] http://bugzilla.redhat.com/1236760 (NEW)
           Component: openstack-tripleo-heat-templates
           Last change: 2016-04-18
           Summary: Drop 'without-mergepy' from main overcloud template

[1266027 ] http://bugzilla.redhat.com/1266027 (NEW)
           Component: openstack-tripleo-heat-templates
           Last change: 2016-04-18
           Summary: TripleO should use pymysql database driver since
                    Liberty

[1230250 ] http://bugzilla.redhat.com/1230250 (ASSIGNED)
           Component: openstack-tripleo-heat-templates
           Last change: 2016-04-18
           Summary: [Unified CLI] Deployment using Tuskar has failed -
                    Deployment exited with non-zero status code: 1

[1301290 ] http://bugzilla.redhat.com/1301290 (ASSIGNED)
           Component: openstack-tripleo-heat-templates
           Last change: 2016-04-18
           Summary: Mitaka -  overcloud deploy gives: [ERROR]
                    /usr/libexec/mysqld: option '--wsrep_notify_cmd'
                    requires an argument

[1271411 ] http://bugzilla.redhat.com/1271411 (NEW)
           Component: openstack-tripleo-heat-templates
           Last change: 2016-04-18
           Summary: Unable to deploy internal api endpoint for keystone on
                    a different network to admin api

[1204479 ] http://bugzilla.redhat.com/1204479 (NEW)
           Component: openstack-tripleo-heat-templates
           Last change: 2016-04-18
           Summary: The ExtraConfig and controllerExtraConfig parameters
                    are ignored in the controller-puppet template

### openstack-tripleo-image-elements (3 bugs)


[1187354 ] http://bugzilla.redhat.com/1187354 (NEW)
           Component: openstack-tripleo-image-elements
           Last change: 2016-04-18
           Summary: possible incorrect selinux check in 97-mysql-selinux

[1303567 ] http://bugzilla.redhat.com/1303567 (NEW)
           Component: openstack-tripleo-image-elements
           Last change: 2016-04-18
           Summary: Overcloud deployment fails using Ceph

[1187965 ] http://bugzilla.redhat.com/1187965 (NEW)
           Component: openstack-tripleo-image-elements
           Last change: 2016-04-18
           Summary: mariadb my.cnf socket path does not exist

### openstack-trove (2 bugs)


[1290156 ] http://bugzilla.redhat.com/1290156 (NEW)
           Component: openstack-trove
           Last change: 2015-12-09
           Summary: Move guestagent settings to default section

[1327068 ] http://bugzilla.redhat.com/1327068 (NEW)
           Component: openstack-trove
           Last change: 2016-04-14
           Summary: trove guest agent should create a sudoers entry

### openstack-tuskar (2 bugs)


[1210223 ] http://bugzilla.redhat.com/1210223 (ASSIGNED)
           Component: openstack-tuskar
           Last change: 2016-04-18
           Summary: Updating the controller count to 3 fails

[1229401 ] http://bugzilla.redhat.com/1229401 (NEW)
           Component: openstack-tuskar
           Last change: 2016-04-18
           Summary: stack is stuck in DELETE_FAILED state

### openstack-utils (1 bug)


[1161501 ] http://bugzilla.redhat.com/1161501 (NEW)
           Component: openstack-utils
           Last change: 2016-04-18
           Summary: Can't enable OpenStack service after openstack-service
                    disable

### openvswitch (1 bug)


[1306443 ] http://bugzilla.redhat.com/1306443 (NEW)
           Component: openvswitch
           Last change: 2016-04-19
           Summary: SegFault on neutron-openvswitch-agent start

### Package Review (13 bugs)


[1283295 ] http://bugzilla.redhat.com/1283295 (NEW)
           Component: Package Review
           Last change: 2015-11-18
           Summary: Review Request: CloudKitty - Rating as a Service

[1326586 ] http://bugzilla.redhat.com/1326586 (NEW)
           Component: Package Review
           Last change: 2016-04-13
           Summary: Review request: Sensu

[1272524 ] http://bugzilla.redhat.com/1272524 (ASSIGNED)
           Component: Package Review
           Last change: 2015-12-03
           Summary: Review Request: openstack-mistral - workflow Service
                    for OpenStack cloud

[1290090 ] http://bugzilla.redhat.com/1290090 (ASSIGNED)
           Component: Package Review
           Last change: 2016-02-29
           Summary: Review Request: python-networking-midonet

[1299959 ] http://bugzilla.redhat.com/1299959 (NEW)
           Component: Package Review
           Last change: 2016-01-22
           Summary: Package Review: python-ironic-cisco

[1290308 ] http://bugzilla.redhat.com/1290308 (ASSIGNED)
           Component: Package Review
           Last change: 2016-03-29
           Summary: Review Request: python-midonetclient

[1311114 ] http://bugzilla.redhat.com/1311114 (NEW)
           Component: Package Review
           Last change: 2016-02-23
           Summary: Request to create 'python-networking-ovn' in openstack-
                    packages

[1272513 ] http://bugzilla.redhat.com/1272513 (ASSIGNED)
           Component: Package Review
           Last change: 2016-04-04
           Summary: Review Request: Murano - is an application catalog for
                    OpenStack

[1293948 ] http://bugzilla.redhat.com/1293948 (NEW)
           Component: Package Review
           Last change: 2015-12-23
           Summary: Review Request: python-kuryr

[1318765 ] http://bugzilla.redhat.com/1318765 (NEW)
           Component: Package Review
           Last change: 2016-04-17
           Summary: Review Request: openstack-sahara-tests - Sahara
                    Scenario Test Framework

[1279513 ] http://bugzilla.redhat.com/1279513 (ASSIGNED)
           Component: Package Review
           Last change: 2016-04-18
           Summary: New Package:  python-dracclient

[1315196 ] http://bugzilla.redhat.com/1315196 (NEW)
           Component: Package Review
           Last change: 2016-04-18
           Summary: PackageReview: openstack-searchlight

[1312328 ] http://bugzilla.redhat.com/1312328 (NEW)
           Component: Package Review
           Last change: 2016-03-08
           Summary: New Package: openstack-ironic-staging-drivers

### python-cinderclient (1 bug)


[1303966 ] http://bugzilla.redhat.com/1303966 (NEW)
           Component: python-cinderclient
           Last change: 2016-04-19
           Summary: Can't re-launch horizon after a controller reboot:
                    ImportError: cannot import name base

### python-glanceclient (2 bugs)


[1244291 ] http://bugzilla.redhat.com/1244291 (ASSIGNED)
           Component: python-glanceclient
           Last change: 2016-04-19
           Summary: python-glanceclient-0.17.0-2.el7.noarch.rpm packaged
                    with buggy glanceclient/common/https.py

[1164349 ] http://bugzilla.redhat.com/1164349 (ASSIGNED)
           Component: python-glanceclient
           Last change: 2016-04-19
           Summary: rdo juno glance client needs python-requests >= 2.2.0

### python-keystonemiddleware (1 bug)


[1195977 ] http://bugzilla.redhat.com/1195977 (NEW)
           Component: python-keystonemiddleware
           Last change: 2016-04-19
           Summary: Rebase python-keystonemiddleware to version 1.3

### python-neutronclient (4 bugs)


[1221063 ] http://bugzilla.redhat.com/1221063 (ASSIGNED)
           Component: python-neutronclient
           Last change: 2016-04-18
           Summary: --router:external=True syntax is invalid - not backward
                    compatibility

[1132541 ] http://bugzilla.redhat.com/1132541 (ASSIGNED)
           Component: python-neutronclient
           Last change: 2016-04-18
           Summary: neutron security-group-rule-list fails with URI too
                    long

[1281352 ] http://bugzilla.redhat.com/1281352 (NEW)
           Component: python-neutronclient
           Last change: 2016-04-18
           Summary: Internal server error when running qos-bandwidth-limit-
                    rule-update as a tenant Edit

[1302567 ] http://bugzilla.redhat.com/1302567 (NEW)
           Component: python-neutronclient
           Last change: 2016-04-18
           Summary: Running neutron net-list in Mitaka returns "list index
                    out of range"

### python-novaclient (2 bugs)


[1123451 ] http://bugzilla.redhat.com/1123451 (ASSIGNED)
           Component: python-novaclient
           Last change: 2016-04-18
           Summary: Missing versioned dependency on python-six

[1313123 ] http://bugzilla.redhat.com/1313123 (NEW)
           Component: python-novaclient
           Last change: 2016-04-18
           Summary: nova get-vnc-console broken

### python-openstackclient (6 bugs)


[1212439 ] http://bugzilla.redhat.com/1212439 (NEW)
           Component: python-openstackclient
           Last change: 2016-04-18
           Summary: Usage is not described accurately for 99% of openstack
                    baremetal

[1212091 ] http://bugzilla.redhat.com/1212091 (NEW)
           Component: python-openstackclient
           Last change: 2016-04-18
           Summary: `openstack ip floating delete` fails if we specify IP
                    address as input

[1317567 ] http://bugzilla.redhat.com/1317567 (NEW)
           Component: python-openstackclient
           Last change: 2016-04-18
           Summary: python-zaqarclient causes "openstack flavor delete" to
                    fail

[1227543 ] http://bugzilla.redhat.com/1227543 (NEW)
           Component: python-openstackclient
           Last change: 2016-04-18
           Summary: openstack undercloud install fails due to a missing
                    make target for tripleo-selinux-keepalived.pp

[1187310 ] http://bugzilla.redhat.com/1187310 (NEW)
           Component: python-openstackclient
           Last change: 2016-04-18
           Summary: Add --user to project list command to filter projects
                    by user

[1239144 ] http://bugzilla.redhat.com/1239144 (NEW)
           Component: python-openstackclient
           Last change: 2016-04-18
           Summary: appdirs requirement

### python-oslo-config (2 bugs)


[1258014 ] http://bugzilla.redhat.com/1258014 (NEW)
           Component: python-oslo-config
           Last change: 2016-04-18
           Summary: oslo_config != oslo.config

[1282093 ] http://bugzilla.redhat.com/1282093 (NEW)
           Component: python-oslo-config
           Last change: 2016-04-18
           Summary: please rebase oslo.log to 1.12.0

### rdo-manager (55 bugs)


[1234467 ] http://bugzilla.redhat.com/1234467 (NEW)
           Component: rdo-manager
           Last change: 2016-04-18
           Summary: cannot access instance vnc console on horizon after
                    overcloud deployment

[1306350 ] http://bugzilla.redhat.com/1306350 (NEW)
           Component: rdo-manager
           Last change: 2016-04-18
           Summary: With RDO-manager, if not configured, the first nic on
                    compute nodes gets addresses from dhcp as a default

[1218281 ] http://bugzilla.redhat.com/1218281 (NEW)
           Component: rdo-manager
           Last change: 2016-04-18
           Summary: RFE: rdo-manager - update heat deployment-show to make
                    puppet output readable

[1269657 ] http://bugzilla.redhat.com/1269657 (NEW)
           Component: rdo-manager
           Last change: 2016-04-18
           Summary: [RFE] Support configuration of default subnet pools

[1264526 ] http://bugzilla.redhat.com/1264526 (NEW)
           Component: rdo-manager
           Last change: 2016-04-18
           Summary: Deployment of Undercloud

[1311662 ] http://bugzilla.redhat.com/1311662 (NEW)
           Component: rdo-manager
           Last change: 2016-04-18
           Summary: With RDO-Manager import instackenv.json gives just
                    "baremetal" and does not import anything

[1273574 ] http://bugzilla.redhat.com/1273574 (ASSIGNED)
           Component: rdo-manager
           Last change: 2016-04-18
           Summary: rdo-manager liberty, delete node is failing

[1213647 ] http://bugzilla.redhat.com/1213647 (NEW)
           Component: rdo-manager
           Last change: 2016-04-18
           Summary: RFE: add deltarpm to all images built

[1221663 ] http://bugzilla.redhat.com/1221663 (NEW)
           Component: rdo-manager
           Last change: 2016-04-18
           Summary: [RFE][RDO-manager]:  Alert when deploying a physical
                    compute if the virtualization flag is disabled in BIOS.

[1306364 ] http://bugzilla.redhat.com/1306364 (NEW)
           Component: rdo-manager
           Last change: 2016-04-18
           Summary: With RDO-manager, using bridge mappings, Neutron
                    opensvswitch-agent plugin's config file don't gets
                    populated correctly

[1274060 ] http://bugzilla.redhat.com/1274060 (NEW)
           Component: rdo-manager
           Last change: 2016-04-18
           Summary: [SELinux][RHEL7] openstack-ironic-inspector-
                    dnsmasq.service fails to start with SELinux enabled

[1294599 ] http://bugzilla.redhat.com/1294599 (NEW)
           Component: rdo-manager
           Last change: 2016-04-18
           Summary: Virtual environment overcloud deploy fails with default
                    memory allocation

[1269655 ] http://bugzilla.redhat.com/1269655 (NEW)
           Component: rdo-manager
           Last change: 2016-04-18
           Summary: [RFE] Support deploying VPNaaS

[1271336 ] http://bugzilla.redhat.com/1271336 (NEW)
           Component: rdo-manager
           Last change: 2016-04-18
           Summary: [RFE] Enable configuration of OVS ARP Responder

[1300444 ] http://bugzilla.redhat.com/1300444 (NEW)
           Component: rdo-manager
           Last change: 2016-04-18
           Summary: RDO Manager is using deprecated nova options

[1269890 ] http://bugzilla.redhat.com/1269890 (NEW)
           Component: rdo-manager
           Last change: 2016-04-18
           Summary: [RFE] Support IPv6

[1214343 ] http://bugzilla.redhat.com/1214343 (NEW)
           Component: rdo-manager
           Last change: 2016-04-18
           Summary: [RFE] Command to create flavors based on real hardware
                    and profiles

[1234475 ] http://bugzilla.redhat.com/1234475 (NEW)
           Component: rdo-manager
           Last change: 2016-04-18
           Summary: Cannot login to Overcloud Horizon through Virtual IP
                    (VIP)

[1226969 ] http://bugzilla.redhat.com/1226969 (NEW)
           Component: rdo-manager
           Last change: 2016-04-18
           Summary: Tempest failed when running after overcloud deployment

[1270370 ] http://bugzilla.redhat.com/1270370 (NEW)
           Component: rdo-manager
           Last change: 2016-04-18
           Summary: [RDO-Manager] bulk introspection moving the nodes from
                    available to manageable too quickly [getting:
                    NodeLocked:]

[1271232 ] http://bugzilla.redhat.com/1271232 (NEW)
           Component: rdo-manager
           Last change: 2016-04-18
           Summary: tempest_lib.exceptions.Conflict: An object with that
                    identifier already exists

[1270805 ] http://bugzilla.redhat.com/1270805 (NEW)
           Component: rdo-manager
           Last change: 2016-04-18
           Summary: Glance client returning 'Expected endpoint'

[1300445 ] http://bugzilla.redhat.com/1300445 (NEW)
           Component: rdo-manager
           Last change: 2016-04-18
           Summary: RDO Manager is using deprecated neutron options

[1276097 ] http://bugzilla.redhat.com/1276097 (NEW)
           Component: rdo-manager
           Last change: 2016-04-18
           Summary: dnsmasq-dhcp: DHCPDISCOVER no address available

[1325929 ] http://bugzilla.redhat.com/1325929 (NEW)
           Component: rdo-manager
           Last change: 2016-04-18
           Summary: overcloud deployment fails with "Error: Could not start
                    Service[nova-compute]: Execution of '/usr/bin/systemctl
                    start openstack-nova-compute' returned 1" during
                    ComputeNodesPostDeployment

[1221986 ] http://bugzilla.redhat.com/1221986 (ASSIGNED)
           Component: rdo-manager
           Last change: 2016-04-18
           Summary: openstack-nova-novncproxy fails to start

[1271317 ] http://bugzilla.redhat.com/1271317 (NEW)
           Component: rdo-manager
           Last change: 2016-04-18
           Summary: instack-virt-setup fails: error Running install-
                    packages install

[1272376 ] http://bugzilla.redhat.com/1272376 (NEW)
           Component: rdo-manager
           Last change: 2016-04-18
           Summary: Duplicate nova hypervisors after rebooting compute
                    nodes

[1227035 ] http://bugzilla.redhat.com/1227035 (ASSIGNED)
           Component: rdo-manager
           Last change: 2016-04-18
           Summary: RDO-Manager Undercloud install fails while trying to
                    insert data into keystone

[1214349 ] http://bugzilla.redhat.com/1214349 (NEW)
           Component: rdo-manager
           Last change: 2016-04-18
           Summary: [RFE] Use Ironic API instead of discoverd one for
                    discovery/introspection

[1233410 ] http://bugzilla.redhat.com/1233410 (NEW)
           Component: rdo-manager
           Last change: 2016-04-18
           Summary: overcloud deployment fails w/ "Message: No valid host
                    was found. There are not enough hosts available., Code:
                    500"

[1227042 ] http://bugzilla.redhat.com/1227042 (NEW)
           Component: rdo-manager
           Last change: 2016-04-18
           Summary: rfe: support Keystone HTTPD

[1223328 ] http://bugzilla.redhat.com/1223328 (NEW)
           Component: rdo-manager
           Last change: 2016-04-18
           Summary: Read bit set for others for Openstack services
                    directories in /etc

[1273121 ] http://bugzilla.redhat.com/1273121 (NEW)
           Component: rdo-manager
           Last change: 2016-04-18
           Summary: openstack help returns errors

[1270910 ] http://bugzilla.redhat.com/1270910 (ASSIGNED)
           Component: rdo-manager
           Last change: 2016-04-18
           Summary: IP address from external subnet gets assigned to br-ex
                    when using default single-nic-vlans templates

[1303002 ] http://bugzilla.redhat.com/1303002 (NEW)
           Component: rdo-manager
           Last change: 2016-04-18
           Summary: RDO-Manager imoort .json file

[1232813 ] http://bugzilla.redhat.com/1232813 (NEW)
           Component: rdo-manager
           Last change: 2016-04-18
           Summary: PXE boot fails: Unrecognized option "--autofree"

[1234484 ] http://bugzilla.redhat.com/1234484 (NEW)
           Component: rdo-manager
           Last change: 2016-04-18
           Summary: cannot view cinder volumes in overcloud controller
                    horizon

[1230582 ] http://bugzilla.redhat.com/1230582 (NEW)
           Component: rdo-manager
           Last change: 2016-04-18
           Summary: there is a newer image that can be used to deploy
                    openstack

[1294683 ] http://bugzilla.redhat.com/1294683 (NEW)
           Component: rdo-manager
           Last change: 2016-04-18
           Summary: instack-undercloud: "openstack undercloud install"
                    throws errors and then gets stuck due to selinux.

[1221718 ] http://bugzilla.redhat.com/1221718 (NEW)
           Component: rdo-manager
           Last change: 2016-04-18
           Summary: rdo-manager: unable to delete the failed overcloud
                    deployment.

[1269622 ] http://bugzilla.redhat.com/1269622 (NEW)
           Component: rdo-manager
           Last change: 2016-04-18
           Summary: [RFE] support override of API and RPC worker counts

[1271289 ] http://bugzilla.redhat.com/1271289 (NEW)
           Component: rdo-manager
           Last change: 2016-04-18
           Summary: overcloud-novacompute  stuck in spawning  state

[1269894 ] http://bugzilla.redhat.com/1269894 (NEW)
           Component: rdo-manager
           Last change: 2016-04-18
           Summary: [RFE] Add creation of demo tenant, network and
                    installation of demo images

[1301009 ] http://bugzilla.redhat.com/1301009 (NEW)
           Component: rdo-manager
           Last change: 2016-04-18
           Summary: Undercloud install failing

[1226389 ] http://bugzilla.redhat.com/1226389 (NEW)
           Component: rdo-manager
           Last change: 2016-04-18
           Summary: RDO-Manager Undercloud install failure

[1269661 ] http://bugzilla.redhat.com/1269661 (NEW)
           Component: rdo-manager
           Last change: 2016-04-18
           Summary: [RFE] Supporting SR-IOV enabled deployments

[1223993 ] http://bugzilla.redhat.com/1223993 (ASSIGNED)
           Component: rdo-manager
           Last change: 2016-04-18
           Summary: overcloud failure with "openstack Authorization Failed:
                    Cannot authenticate without an auth_url"

[1216981 ] http://bugzilla.redhat.com/1216981 (ASSIGNED)
           Component: rdo-manager
           Last change: 2016-04-18
           Summary: No way to increase yum timeouts when building images

[1273541 ] http://bugzilla.redhat.com/1273541 (NEW)
           Component: rdo-manager
           Last change: 2016-04-18
           Summary: RDO-Manager needs epel.repo enabled (otherwise
                    undercloud deployment fails.)

[1292253 ] http://bugzilla.redhat.com/1292253 (NEW)
           Component: rdo-manager
           Last change: 2016-04-18
           Summary: Production + EPEL + yum-plugin-priorities results in
                    wrong version of hiera

[1271726 ] http://bugzilla.redhat.com/1271726 (NEW)
           Component: rdo-manager
           Last change: 2016-04-18
           Summary: 1 of the overcloud VMs (nova) is stack in spawning
                    state

[1229343 ] http://bugzilla.redhat.com/1229343 (NEW)
           Component: rdo-manager
           Last change: 2016-04-18
           Summary: instack-virt-setup missing package dependency device-
                    mapper*

[1212520 ] http://bugzilla.redhat.com/1212520 (NEW)
           Component: rdo-manager
           Last change: 2016-04-18
           Summary: [RFE] [CI] Add ability to generate and store overcloud
                    images provided by latest-passed-ci

[1273680 ] http://bugzilla.redhat.com/1273680 (ASSIGNED)
           Component: rdo-manager
           Last change: 2016-04-18
           Summary: HA overcloud with network isolation deployment fails

### rdo-manager-cli (6 bugs)


[1212467 ] http://bugzilla.redhat.com/1212467 (ASSIGNED)
           Component: rdo-manager-cli
           Last change: 2016-04-18
           Summary: [RFE] [RDO-Manager] [CLI] Add an ability to create an
                    overcloud image associated with kernel/ramdisk images
                    in one CLI step

[1230170 ] http://bugzilla.redhat.com/1230170 (ASSIGNED)
           Component: rdo-manager-cli
           Last change: 2016-04-18
           Summary: the ouptut of openstack management plan show --long
                    command is not readable

[1226855 ] http://bugzilla.redhat.com/1226855 (ASSIGNED)
           Component: rdo-manager-cli
           Last change: 2016-04-18
           Summary: Role was added to a template with empty flavor value

[1228769 ] http://bugzilla.redhat.com/1228769 (ASSIGNED)
           Component: rdo-manager-cli
           Last change: 2016-04-18
           Summary: Missing dependencies on sysbench and fio (RHEL)

[1212390 ] http://bugzilla.redhat.com/1212390 (ASSIGNED)
           Component: rdo-manager-cli
           Last change: 2016-04-18
           Summary: [RFE] [RDO-Manager] [CLI] Add ability to show matched
                    profiles via CLI command

[1212371 ] http://bugzilla.redhat.com/1212371 (ASSIGNED)
           Component: rdo-manager-cli
           Last change: 2016-04-18
           Summary: Validate node power credentials after enrolling

### rdo-manager-gui (4 bugs)


[1316608 ] http://bugzilla.redhat.com/1316608 (NEW)
           Component: rdo-manager-gui
           Last change: 2016-04-18
           Summary: [RFE] Progress bar for plan upload

[1317426 ] http://bugzilla.redhat.com/1317426 (NEW)
           Component: rdo-manager-gui
           Last change: 2016-04-18
           Summary: Can't open the "Edit Parameters" screen, an exception
                    is dumped to the tripleo-api console

[1317474 ] http://bugzilla.redhat.com/1317474 (NEW)
           Component: rdo-manager-gui
           Last change: 2016-03-14
           Summary: After refreshing (F5) the plans list it looks like
                    there are no plans at all in the system

[1317511 ] http://bugzilla.redhat.com/1317511 (NEW)
           Component: rdo-manager-gui
           Last change: 2016-03-14
           Summary: When no nodes are registered, hardware validations
                    should be disabled

### rdopkg (2 bugs)


[1306485 ] http://bugzilla.redhat.com/1306485 (NEW)
           Component: rdopkg
           Last change: 2016-02-17
           Summary: centos 7.2 need to do "systemctl enable rabbitmq-
                    server" before "packstack --allinone --provision-
                    demo=n"

[1100405 ] http://bugzilla.redhat.com/1100405 (ASSIGNED)
           Component: rdopkg
           Last change: 2014-05-22
           Summary: [RFE] Add option to force overwrite build files on
                    update download

### RFEs (2 bugs)


[1193886 ] http://bugzilla.redhat.com/1193886 (ASSIGNED)
           Component: RFEs
           Last change: 2016-04-18
           Summary: RFE: wait for DB after boot

[1158517 ] http://bugzilla.redhat.com/1158517 (NEW)
           Component: RFEs
           Last change: 2016-04-18
           Summary: [RFE] Provide easy to use upgrade tool

### tempest (2 bugs)


[1272289 ] http://bugzilla.redhat.com/1272289 (ASSIGNED)
           Component: tempest
           Last change: 2016-04-19
           Summary: rdo-manager tempest smoke test failing on "floating ip
                    pool not found'

[1250081 ] http://bugzilla.redhat.com/1250081 (NEW)
           Component: tempest
           Last change: 2015-08-06
           Summary: test_minimum_basic scenario failed to run on rdo-
                    manager


## Fixed bugs

This is a list of "fixed" bugs by component.  A "fixed" bug is fixed state
MODIFIED, POST, ON_QA and has been fixed.  You can help
out by testing the fix to make sure it works as intended.

(60 bugs)


### distribution (1 bug)


[1134121 ] http://bugzilla.redhat.com/1134121 (POST)
           Component: distribution
           Last change: 2016-04-18
           Summary: Tuskar Fails After Remove/Reinstall Of RDO

### openstack-ceilometer (2 bugs)


[1194230 ] http://bugzilla.redhat.com/1194230 (POST)
           Component: openstack-ceilometer
           Last change: 2016-04-18
           Summary: The /etc/sudoers.d/ceilometer have incorrect
                    permissions

[1287252 ] http://bugzilla.redhat.com/1287252 (POST)
           Component: openstack-ceilometer
           Last change: 2016-04-18
           Summary: openstack-ceilometer-alarm-notifier does not start:
                    unit file is missing

### openstack-cinder (1 bug)


[1234038 ] http://bugzilla.redhat.com/1234038 (POST)
           Component: openstack-cinder
           Last change: 2016-04-19
           Summary: Packstack Error: cinder type-create iscsi returned 1
                    instead of one of [0]

### openstack-glance (1 bug)


[1074724 ] http://bugzilla.redhat.com/1074724 (POST)
           Component: openstack-glance
           Last change: 2016-04-19
           Summary: Glance api ssl issue

### openstack-neutron (2 bugs)


[1049807 ] http://bugzilla.redhat.com/1049807 (POST)
           Component: openstack-neutron
           Last change: 2016-04-19
           Summary: neutron-dhcp-agent fails to start with plenty of
                    SELinux AVC denials

[1281920 ] http://bugzilla.redhat.com/1281920 (POST)
           Component: openstack-neutron
           Last change: 2016-04-19
           Summary: neutron-server will not start: fails with pbr version
                    issue

### openstack-nova (2 bugs)


[1189347 ] http://bugzilla.redhat.com/1189347 (POST)
           Component: openstack-nova
           Last change: 2016-04-18
           Summary: openstack-nova-* systemd unit files need
                    NotifyAccess=all

[1301156 ] http://bugzilla.redhat.com/1301156 (POST)
           Component: openstack-nova
           Last change: 2016-04-18
           Summary: openstack-nova missing specfile requires on
                    castellan>=0.3.1

### openstack-packstack (24 bugs)


[1153128 ] http://bugzilla.redhat.com/1153128 (POST)
           Component: openstack-packstack
           Last change: 2016-04-18
           Summary: Cannot start nova-network on juno - Centos7

[1288179 ] http://bugzilla.redhat.com/1288179 (POST)
           Component: openstack-packstack
           Last change: 2016-04-18
           Summary: Mitaka: Packstack image provisioning fails with "Store
                    filesystem could not be configured correctly"

[1205912 ] http://bugzilla.redhat.com/1205912 (POST)
           Component: openstack-packstack
           Last change: 2016-04-19
           Summary: allow to specify admin name and email

[1088964 ] http://bugzilla.redhat.com/1088964 (POST)
           Component: openstack-packstack
           Last change: 2016-04-18
           Summary: Havana Fedora 19, packstack fails w/ mysql error

[1101665 ] http://bugzilla.redhat.com/1101665 (POST)
           Component: openstack-packstack
           Last change: 2016-04-18
           Summary: el7 Icehouse: Nagios installation fails

[1049537 ] http://bugzilla.redhat.com/1049537 (POST)
           Component: openstack-packstack
           Last change: 2016-04-18
           Summary: Horizon help url in RDO points to the RHOS
                    documentation

[1298245 ] http://bugzilla.redhat.com/1298245 (MODIFIED)
           Component: openstack-packstack
           Last change: 2016-04-18
           Summary: Add possibility to change DEFAULT/api_paste_config in
                    trove.conf

[1148949 ] http://bugzilla.redhat.com/1148949 (POST)
           Component: openstack-packstack
           Last change: 2016-04-18
           Summary: openstack-packstack: installed  "packstack --allinone"
                    on Centos7.0 and configured private networking. The
                    booted VMs are not able to communicate with each other,
                    nor ping the gateway.

[995570  ] http://bugzilla.redhat.com/995570 (POST)
           Component: openstack-packstack
           Last change: 2016-04-18
           Summary: RFE: support setting up apache to serve keystone
                    requests

[1266028 ] http://bugzilla.redhat.com/1266028 (POST)
           Component: openstack-packstack
           Last change: 2016-04-18
           Summary: Packstack should use pymysql database driver since
                    Liberty

[1290429 ] http://bugzilla.redhat.com/1290429 (POST)
           Component: openstack-packstack
           Last change: 2016-04-18
           Summary: Packstack does not correctly configure Nova
                    notifications for Neutron in Mitaka-1

[1249482 ] http://bugzilla.redhat.com/1249482 (POST)
           Component: openstack-packstack
           Last change: 2016-04-18
           Summary: Packstack (AIO) failure on F22 due to patch "Run
                    neutron db sync also for each neutron module"‏

[1028690 ] http://bugzilla.redhat.com/1028690 (POST)
           Component: openstack-packstack
           Last change: 2016-04-18
           Summary: packstack requires 2 runs to install ceilometer

[1018900 ] http://bugzilla.redhat.com/1018900 (POST)
           Component: openstack-packstack
           Last change: 2016-04-18
           Summary: Packstack fails with "The iptables provider can not
                    handle attribute outiface"

[1080369 ] http://bugzilla.redhat.com/1080369 (POST)
           Component: openstack-packstack
           Last change: 2016-04-18
           Summary: packstack fails with KeyError
                    :CONFIG_PROVISION_DEMO_FLOATRANGE if more compute-hosts
                    are added

[1302275 ] http://bugzilla.redhat.com/1302275 (POST)
           Component: openstack-packstack
           Last change: 2016-04-18
           Summary: neutron-l3-agent does not start on Mitaka-2 when
                    enabling FWaaS

[1302256 ] http://bugzilla.redhat.com/1302256 (POST)
           Component: openstack-packstack
           Last change: 2016-04-18
           Summary: neutron-server does not start on Mitaka-2 when enabling
                    LBaaS

[1150652 ] http://bugzilla.redhat.com/1150652 (POST)
           Component: openstack-packstack
           Last change: 2016-04-18
           Summary: PackStack does not provide an option to register hosts
                    to Red Hat Satellite 6

[1082729 ] http://bugzilla.redhat.com/1082729 (POST)
           Component: openstack-packstack
           Last change: 2016-04-18
           Summary: [RFE] allow for Keystone/LDAP configuration at
                    deployment time

[1124982 ] http://bugzilla.redhat.com/1124982 (POST)
           Component: openstack-packstack
           Last change: 2016-04-18
           Summary: Help text for SSL is incorrect regarding passphrase on
                    the cert

[1175450 ] http://bugzilla.redhat.com/1175450 (POST)
           Component: openstack-packstack
           Last change: 2016-04-18
           Summary: packstack fails to start Nova on Rawhide: Error:
                    comparison of String with 18 failed at
                    [...]ceilometer/manifests/params.pp:32

[1285314 ] http://bugzilla.redhat.com/1285314 (POST)
           Component: openstack-packstack
           Last change: 2016-04-18
           Summary: Packstack needs to support aodh services since Mitaka

[1297833 ] http://bugzilla.redhat.com/1297833 (POST)
           Component: openstack-packstack
           Last change: 2016-04-19
           Summary: VPNaaS should use libreswan driver instead of openswan
                    by default

[1187412 ] http://bugzilla.redhat.com/1187412 (POST)
           Component: openstack-packstack
           Last change: 2016-04-18
           Summary: Script wording for service installation should be
                    consistent

### openstack-puppet-modules (1 bug)


[1302321 ] http://bugzilla.redhat.com/1302321 (POST)
           Component: openstack-puppet-modules
           Last change: 2016-04-18
           Summary: During RDO packstack install Error: Could not set
                    'present' on ensure: uninitialized constant DEFAULT

### openstack-selinux (1 bug)


[1144539 ] http://bugzilla.redhat.com/1144539 (POST)
           Component: openstack-selinux
           Last change: 2016-04-18
           Summary: selinux preventing Horizon access (IceHouse, CentOS 7)

### openstack-tripleo-heat-templates (1 bug)


[1235508 ] http://bugzilla.redhat.com/1235508 (POST)
           Component: openstack-tripleo-heat-templates
           Last change: 2016-04-18
           Summary: Package update does not take puppet managed packages
                    into account

### openstack-tuskar (1 bug)


[1229493 ] http://bugzilla.redhat.com/1229493 (POST)
           Component: openstack-tuskar
           Last change: 2016-04-18
           Summary: Difficult to synchronise tuskar stored files with
                    /usr/share/openstack-tripleo-heat-templates

### openstack-utils (3 bugs)


[1214044 ] http://bugzilla.redhat.com/1214044 (POST)
           Component: openstack-utils
           Last change: 2016-04-18
           Summary: update openstack-status for rdo-manager

[1211989 ] http://bugzilla.redhat.com/1211989 (POST)
           Component: openstack-utils
           Last change: 2016-04-18
           Summary: openstack-status shows 'disabled on boot' for the
                    mysqld service

[1213150 ] http://bugzilla.redhat.com/1213150 (POST)
           Component: openstack-utils
           Last change: 2016-04-18
           Summary: openstack-status as admin falsely shows zero instances

### Package Review (2 bugs)


[1323222 ] http://bugzilla.redhat.com/1323222 (ON_QA)
           Component: Package Review
           Last change: 2016-04-13
           Summary: Review request for openstack-sahara-ui

[1323219 ] http://bugzilla.redhat.com/1323219 (ON_QA)
           Component: Package Review
           Last change: 2016-04-13
           Summary: Review Request: openstack-trove-ui - OpenStack
                    Dashboard plugin for Trove project

### python-heatclient (1 bug)


[1087089 ] http://bugzilla.redhat.com/1087089 (POST)
           Component: python-heatclient
           Last change: 2016-04-19
           Summary: python-heatclient 0.2.9 requires packaging in RDO

### python-keystoneclient (1 bug)


[973263  ] http://bugzilla.redhat.com/973263 (POST)
           Component: python-keystoneclient
           Last change: 2016-04-19
           Summary: user-get fails when using IDs which are not UUIDs

### python-openstackclient (1 bug)


[1171191 ] http://bugzilla.redhat.com/1171191 (POST)
           Component: python-openstackclient
           Last change: 2016-04-18
           Summary: Rebase python-openstackclient to version 1.0.0

### python-tuskarclient (1 bug)


[1209395 ] http://bugzilla.redhat.com/1209395 (POST)
           Component: python-tuskarclient
           Last change: 2016-04-18
           Summary: `tuskar help` is missing a description next to plan-
                    templates

### rdo-manager (5 bugs)


[1212351 ] http://bugzilla.redhat.com/1212351 (POST)
           Component: rdo-manager
           Last change: 2016-04-18
           Summary: [RFE] [RDO-Manager] [CLI] Add ability to poll for
                    discovery state via CLI command

[1270033 ] http://bugzilla.redhat.com/1270033 (POST)
           Component: rdo-manager
           Last change: 2016-04-18
           Summary: [RDO-Manager] Node inspection fails when changing the
                    default 'inspection_iprange' value in undecloud.conf.

[1271335 ] http://bugzilla.redhat.com/1271335 (POST)
           Component: rdo-manager
           Last change: 2016-04-18
           Summary: [RFE] Support explicit configuration of L2 population

[1251267 ] http://bugzilla.redhat.com/1251267 (POST)
           Component: rdo-manager
           Last change: 2016-04-18
           Summary: Overcloud deployment fails for unspecified reason

[1268990 ] http://bugzilla.redhat.com/1268990 (POST)
           Component: rdo-manager
           Last change: 2016-04-18
           Summary: missing from docs   Build images fails without : export
                    DIB_YUM_REPO_CONF="/etc/yum.repos.d/delorean.repo
                    /etc/yum.repos.d/delorean-deps.repo"

### rdo-manager-cli (9 bugs)


[1212367 ] http://bugzilla.redhat.com/1212367 (POST)
           Component: rdo-manager-cli
           Last change: 2016-04-18
           Summary: Ensure proper nodes states after enroll and before
                    deployment

[1273197 ] http://bugzilla.redhat.com/1273197 (POST)
           Component: rdo-manager-cli
           Last change: 2016-04-18
           Summary: VXLAN should be default neutron network type

[1233429 ] http://bugzilla.redhat.com/1233429 (POST)
           Component: rdo-manager-cli
           Last change: 2016-04-18
           Summary: Lack of consistency in specifying plan argument for
                    openstack overcloud commands

[1229912 ] http://bugzilla.redhat.com/1229912 (POST)
           Component: rdo-manager-cli
           Last change: 2016-04-18
           Summary: [rdo-manager-cli][unified-cli]: The command 'openstack
                    baremetal configure boot' fails over - AttributeError
                    (when glance images were uploaded more than once)  .

[1219053 ] http://bugzilla.redhat.com/1219053 (POST)
           Component: rdo-manager-cli
           Last change: 2016-04-18
           Summary: "list" command doesn't display nodes in some cases

[1211190 ] http://bugzilla.redhat.com/1211190 (POST)
           Component: rdo-manager-cli
           Last change: 2016-04-18
           Summary: Unable to replace nodes registration instack script due
                    to missing post config action in unified CLI

[1230265 ] http://bugzilla.redhat.com/1230265 (POST)
           Component: rdo-manager-cli
           Last change: 2016-04-18
           Summary: [rdo-manager-cli][unified-cli]:  openstack unified-cli
                    commands display - Warning Module novaclient.v1_1 is
                    deprecated.

[1278972 ] http://bugzilla.redhat.com/1278972 (POST)
           Component: rdo-manager-cli
           Last change: 2016-04-18
           Summary: rdo-manager liberty delorean dib failing w/  "No module
                    named passlib.utils"

[1232838 ] http://bugzilla.redhat.com/1232838 (POST)
           Component: rdo-manager-cli
           Last change: 2016-04-18
           Summary: OSC plugin isn't saving plan configuration values

Thanks,

Chandan Kumar


[Date Prev][Date Next]   [Thread Prev][Thread Next]   [Thread Index] [Date Index] [Author Index]