[Date Prev][Date Next]   [Thread Prev][Thread Next]   [Thread Index] [Date Index] [Author Index]

Re: Building older FC3 Firefox on FC5



David Scholes <David Scholes PlugIntoNetRealty com>,For users of Fedora Core
releases <fedora-list redhat com> wrote: 
> Because of obscure printing issues I'm trying to go back to the firefox that
was
> on FC3 before I upgraded. I've installed several libraries and applied a patch
> but looks like I'm still missing a lib. Below are the messages. Any ideas? I'm
a
> little new at this.  I'm using firefox-1.0.7-1.1.fc3.src.rpm.  Thanks, David
> 
> gcc -o Linux2.6_x86_glibc_PTH_OPT.OBJ/mangle.o -c -O2 -fPIC -DLINUX1_2 -Di386
> -D_XOPEN_SOURCE -DLINUX2_1 -ansi -Wall -pipe -DLINUX -Dlinux -D_POSIX_SOURCE
> -D_BSD_SOURCE -DHAVE_STRERROR -DXP_UNIX -DSHLIB_SUFFIX=\"so\"
> -DSHLIB_PREFIX=\"lib\" -UDEBUG -DNDEBUG -D_REENTRANT
> -I/usr/src/redhat/BUILD/mozilla/dist/include  -I../../../../../dist/public/nss
> -I../../../../../dist/private/nss -I../../../../../dist/include
> -I/usr/src/redhat/BUILD/mozilla/dist/include/nspr
> -I/usr/src/redhat/BUILD/mozilla/dist/include/dbm  mangle.c
> /usr/bin/gmake -j1: *** No rule to make target
> /usr/src/redhat/BUILD/mozilla/dist/lib/libnss.a.  Stop.
> gmake[5]: *** [/usr/src/redhat/BUILD/mozilla/dist/lib/libnss.a] Error 1
> gmake[5]: Leaving directory
> `/usr/src/redhat/BUILD/mozilla/security/nss/cmd/shlibsign/mangle'
> Thu May  4 13:46:13 MDT 2006
> Linux2.6_x86_glibc_PTH_OPT.OBJ/shlibsign -v -i
> /usr/src/redhat/BUILD/mozilla/dist/lib/libsoftokn3.so
> Generating DSA Key Pair....Generating PQG Params: An I/O error occurred during
> security authorization.
> gmake[4]: *** [/usr/src/redhat/BUILD/mozilla/dist/lib/libsoftokn3.chk] Error 1
> gmake[4]: Leaving directory
> `/usr/src/redhat/BUILD/mozilla/security/nss/cmd/shlibsign'
> gmake[3]: *** [libs] Error 2
> gmake[3]: Leaving directory `/usr/src/redhat/BUILD/mozilla/security/manager'
> gmake[2]: *** [tier_40] Error 2
> gmake[2]: Leaving directory `/usr/src/redhat/BUILD/mozilla'
> gmake[1]: *** [default] Error 2
> gmake[1]: Leaving directory `/usr/src/redhat/BUILD/mozilla'
> make: *** [build] Error 2
> error: Bad exit status from /var/tmp/rpm-tmp.63736 (%build)
> 

TEMP Solution found by installing this instead:
http://download.mozilla.org/?product=firefox-1.0.8&os=linux&lang=en-US

Also getting by with using plain "mozilla" browser.

I'm asking the developers of the site I use that has the printing problem
(wfrmls.com) to create a non-password protected test case so the Firefox team
has something to recreate the bug in 1.5.0.3.


[Date Prev][Date Next]   [Thread Prev][Thread Next]   [Thread Index] [Date Index] [Author Index]