[Date Prev][Date Next]   [Thread Prev][Thread Next]   [Thread Index] [Date Index] [Author Index]

Re: Intel(r) Core?2 Duo Processors"



On 15/10/06, Ian Malone <ibmalone gmail com> wrote:
In Fedora it's a package by itself, does apt have an equivalent to
yum whatprovides?

No, so I tried to install from source. Got this output when I ran
make. "./configure" ran fine, however:

dotancohen ubuntu:~/Desktop/chkconfig-1.1.0a$ make
make  all-recursive
make[1]: Entering directory `/home/dotancohen/Desktop/chkconfig-1.1.0a'
Making all in intl
make[2]: Entering directory `/home/dotancohen/Desktop/chkconfig-1.1.0a/intl'
make[2]: Nothing to be done for `all'.
make[2]: Leaving directory `/home/dotancohen/Desktop/chkconfig-1.1.0a/intl'
Making all in po
make[2]: Entering directory `/home/dotancohen/Desktop/chkconfig-1.1.0a/po'
make[2]: Leaving directory `/home/dotancohen/Desktop/chkconfig-1.1.0a/po'
make[2]: Entering directory `/home/dotancohen/Desktop/chkconfig-1.1.0a'
gcc -DLOCALEDIR=\"/usr/local/share/locale\" -DRUNLEVELS=\"/etc\"
-DHAVE_CONFIG_H -I./intl -I.    -g -O2 -c ntsysv.c
ntsysv.c:14:18: error: newt.h: No such file or directory
ntsysv.c: In function 'servicesWindow':
ntsysv.c:31: error: 'newtComponent' undeclared (first use in this function)
ntsysv.c:31: error: (Each undeclared identifier is reported only once
ntsysv.c:31: error: for each function it appears in.)
ntsysv.c:31: error: syntax error before 'label'
ntsysv.c:32: error: 'checkboxes' undeclared (first use in this function)
ntsysv.c:32: error: 'form' undeclared (first use in this function)
ntsysv.c:32: error: 'curr' undeclared (first use in this function)
ntsysv.c:32: error: 'blank' undeclared (first use in this function)
ntsysv.c:33: error: syntax error before 'sb'
ntsysv.c:34: error: 'newtGrid' undeclared (first use in this function)
ntsysv.c:37: error: storage size of 'e' isn't known
ntsysv.c:41: error: 'sb' undeclared (first use in this function)
ntsysv.c:41: error: 'NEWT_COLORSET_CHECKBOX' undeclared (first use in
this function)
ntsysv.c:42: error: 'NEWT_COLORSET_ACTCHECKBOX' undeclared (first use
in this function)
ntsysv.c:44: error: 'subform' undeclared (first use in this function)
ntsysv.c:65: error: 'buttons' undeclared (first use in this function)
ntsysv.c:65: error: 'ok' undeclared (first use in this function)
ntsysv.c:66: error: 'cancel' undeclared (first use in this function)
ntsysv.c:73: error: 'subgrid' undeclared (first use in this function)
ntsysv.c:73: error: 'NEWT_GRID_COMPONENT' undeclared (first use in
this function)
ntsysv.c:77: error: 'label' undeclared (first use in this function)
ntsysv.c:79: error: 'grid' undeclared (first use in this function)
ntsysv.c:86: error: 'NEWT_KEY_F1' undeclared (first use in this function)
ntsysv.c:91: error: 'NEWT_EXIT_HOTKEY' undeclared (first use in this function)
ntsysv.c:92: error: 'NEWT_KEY_F12' undeclared (first use in this function)
ntsysv.c: In function 'main':
ntsysv.c:215: warning: passing argument 3 of 'poptGetContext' from
incompatible pointer type
make[2]: *** [ntsysv.o] Error 1
make[2]: Leaving directory `/home/dotancohen/Desktop/chkconfig-1.1.0a'
make[1]: *** [all-recursive] Error 1
make[1]: Leaving directory `/home/dotancohen/Desktop/chkconfig-1.1.0a'
make: *** [all-recursive-am] Error 2
dotancohen ubuntu:~/Desktop/chkconfig-1.1.0a$

Dotan Cohen

http://gmail-com.com/
http://auto-car.info/


[Date Prev][Date Next]   [Thread Prev][Thread Next]   [Thread Index] [Date Index] [Author Index]