[Date Prev][Date Next]   [Thread Prev][Thread Next]   [Thread Index] [Date Index] [Author Index]

Compile Errors with RPM 4



Hello,

Trying to compile RPM v4.0.  It can't find db3 stuff.

I can't find it either, anywhere, on the web.

Please Help,
Torsten
mailto:torsten@inetw.net




Relevant Output
-------------------------------------------------------------
Making all in tools
make[2]: Entering directory `/home/torsten/src/rpm-4.0/tools'
/bin/sh ../libtool --mode=link gcc  -O3 -mcpu=i686 -march=i686 -I/usr/local/include -D_GNU_SOURCE -Wall -Wpointer-arith -Wstrict-prototypes -Wmissing-prototypes -Wno-char-subscripts  -o dump  dump.o ../build/librpmbuild.la        ../lib/librpm.la        ../rpmio/librpmio.la    ../popt/libpopt.la    
gcc -O3 -mcpu=i686 -march=i686 -I/usr/local/include -D_GNU_SOURCE -Wall -Wpointer-arith -Wstrict-prototypes -Wmissing-prototypes -Wno-char-subscripts -o .libs/dump dump.o ../build/.libs/librpmbuild.so ../lib/.libs/librpm.so -ldb1 ../rpmio/.libs/librpmio.so -L/usr/local/rpm/lib -L/usr/local/lib -lz -lbz2 ../popt/.libs/libpopt.so -Wl,--rpath -Wl,/usr/local/rpm/lib
/usr/i686-pc-linux-gnu/bin/ld: cannot open output file .libs/dump: Permission denied
collect2: ld returned 1 exit status
make[2]: *** [dump] Error 1
make[2]: Leaving directory `/home/torsten/src/rpm-4.0/tools'
make[1]: *** [all-recursive] Error 1
make[1]: Leaving directory `/home/torsten/src/rpm-4.0'
make: *** [all-recursive-am] Error 2
bash-2.04$ 





[Date Prev][Date Next]   [Thread Prev][Thread Next]   [Thread Index] [Date Index] [Author Index] []