[Date Prev][Date Next]   [Thread Prev][Thread Next]   [Thread Index] [Date Index] [Author Index]

Build errors compiling RPM 4.0



Hi,

I'm trying to compile RPM-4.0, but am getting the following error.
Any suggestions?

Thanks in advance,

Ravi

----------------------------------------------------------------------------
------------------

make[2]: Leaving directory `/auto/home/ravi/RPM_TEST/rpm-4.0/misc'
Making all in tools
make[2]: Entering directory `/auto/home/ravi/RPM_TEST/rpm-4.0/tools'
/bin/sh ../libtool --mode=link gcc  -g -O2 -D_GNU_SOURCE -Wall
-Wpointer-arith -Wstrict-prototypes -Wmissing-prototypes
-Wno-char-subscripts  -o dump  dump.o ../build/librpmbuild.la
../lib/librpm.la        ../rpmio/librpmio.la      ../popt/libpopt.la       
gcc -g -O2 -D_GNU_SOURCE -Wall -Wpointer-arith -Wstrict-prototypes
-Wmissing-prototypes -Wno-char-subscripts -o .libs/dump dump.o
../build/.libs/librpmbuild.so ../lib/.libs/librpm.so -ldb1
../rpmio/.libs/librpmio.so -L/usr/local/lib -lz -lbz2
../popt/.libs/libpopt.so
../lib/.libs/librpm.so: undefined reference to `db3Free'
../lib/.libs/librpm.so: undefined reference to `db3New'
collect2: ld returned 1 exit status
make[2]: *** [dump] Error 1
make[2]: Leaving directory `/auto/home/ravi/RPM_TEST/rpm-4.0/tools'
make[1]: *** [all-recursive] Error 1
make[1]: Leaving directory `/auto/home/ravi/RPM_TEST/rpm-4.0'
make: *** [all-recursive-am] Error 2






[Date Prev][Date Next]   [Thread Prev][Thread Next]   [Thread Index] [Date Index] [Author Index] []